program: Orca
programVersion: 5.0.3
elementType: Cl N N N N C C C C C C C C C C H H H H H H H H H H H
charge: 0
multiplicity: 1
keywords: wb97x-d3
keywords: def2-TZVPP
keywords: def2/J RIJCOSX
keywords: DEFGRID2
keywords: scfconv7
keywords: smallprint printgap noloewdin
keywords: NOSOSCF
formula: C10H11ClN4
InChI: InChI=1/C10H11ClN4/c1-8(14-7-12)15(2)6-9-3-4-10(11)13-5-9/h3-5H,6H2,1-2H3
26 atoms
Cl -4.084557 1.470064 0.225219
N  1.860162 -1.67633 0.171704
N  -2.197376 0.454416 -1.248484
N  2.217518 0.426074 -0.544793
N  3.282967 2.648069 -0.5735
C  0.787772 -1.775279 -0.806246
C  -0.421423 -0.948101 -0.465251
C  2.539352 -0.536497 0.281717
C  2.093776 -2.845117 0.997825
C  -0.928238 -0.854081 0.826519
C  -1.100124 -0.263528 -1.461664
C  3.610299 -0.42278 1.319601
C  -2.063114 -0.101152 1.06583
C  -2.651031 0.523517 -0.022881
C  2.816305 1.585623 -0.517291
H  0.50315 -2.826736 -0.863526
H  1.15834 -1.495803 -1.793642
H  1.270347 -3.002863 1.69632
H  3.013035 -2.762068 1.566626
H  2.177445 -3.727213 0.363827
H  -0.446247 -1.357645 1.655213
H  -0.740088 -0.290394 -2.484695
H  4.025145 0.581581 1.348098
H  4.428212 -1.11358 1.111224
H  3.223611 -0.654121 2.311972
H  -2.474603 -0.00731 2.060763
elementType: Cl N C H
totalener: -1066.95572433 hartree
nucrepener: 1028.83844485 hartree
electener: -2095.79416918 hartree
oneelecener: -3498.50136911 hartree
twoeener: 1402.70719993 hartree
cpcmener: -0.04270877 hartree
kineticenergy: 1063.64436032 hartree
xcener: -80.305376188288 hartree
chargesum: 0.0000000
charge: -0.090701 -0.118274 -0.325125 -0.441686 -0.255582 0.059387 -0.005614 0.344642 -0.163410 -0.138082 -0.014067 -0.240176 -0.169065 0.193231 0.021122 0.118137 0.112708 0.113271 0.120374 0.116279 0.151092 0.129989 0.095266 0.119422 0.119857 0.147005
qa: -0.0907 -0.1183 -0.3251 -0.4417 -0.2556 0.0594 -0.0056 0.3446 -0.1634 -0.1381 -0.0141 -0.2402 -0.1691 0.1932 0.0211 0.1181 0.1127 0.1133 0.1204 0.1163 0.1511 0.1300 0.0953 0.1194 0.1199 0.1470
va: 1.2109 3.2925 3.0491 2.9138 3.1265 3.7483 3.6300 3.8592 3.8961 3.9789 4.0934 3.9651 3.9822 4.1242 4.3696 0.9953 1.0182 0.9845 0.9976 0.9934 0.9990 1.0106 1.0240 0.9948 0.9953 1.0048
dispcorr: -0.011286238 hartree
energy: -1066.967010568940
dipole: 20.65000 -19.84488 0.80511 -17.32915 12.13724 -5.19191 6.27131 -4.06909 2.20222
magnitude: 5.69683 au
magnitude: 14.48020 debye
