program: Orca
programVersion: 5.0.3
elementType: Cl N N N N C C C C C C C C C C H H H H H H H H H H H
charge: 0
multiplicity: 1
keywords: wb97x-d3
keywords: def2-TZVPP
keywords: def2/J RIJCOSX
keywords: DEFGRID2
keywords: scfconv7
keywords: smallprint printgap noloewdin
keywords: NOSOSCF
formula: C10H11ClN4
InChI: InChI=1/C10H11ClN4/c1-8(14-7-12)15(2)6-9-3-4-10(11)13-5-9/h3-5H,6H2,1-2H3
26 atoms
Cl -3.998735 1.529842 -0.628941
N  1.875161 -1.683023 -0.064752
N  -2.354745 0.326171 0.987814
N  2.103216 0.355407 0.860701
N  3.117724 2.579761 1.173726
C  0.681774 -1.866696 0.746714
C  -0.472839 -0.999004 0.32602
C  2.540758 -0.532286 0.003166
C  2.238096 -2.778675 -0.942626
C  -0.782884 -0.758334 -1.008191
C  -1.297549 -0.423455 1.280405
C  3.727265 -0.322279 -0.883146
C  -1.873936 0.028008 -1.328391
C  -2.618967 0.537251 -0.276303
C  2.678626 1.520055 0.990062
H  0.914426 -1.688732 1.797848
H  0.397212 -2.916137 0.66158
H  3.231232 -2.650496 -1.358474
H  1.52855 -2.875597 -1.765866
H  2.236703 -3.710654 -0.378476
H  -0.17948 -1.172452 -1.806579
H  -1.094757 -0.568402 2.336231
H  3.479119 -0.509743 -1.927455
H  4.540984 -0.994513 -0.607314
H  4.099794 0.696122 -0.806295
H  -2.133004 0.235101 -2.356872
elementType: Cl N C H
totalener: -1066.95564776 hartree
nucrepener: 1030.19068812 hartree
electener: -2097.14633588 hartree
oneelecener: -3501.20931509 hartree
twoeener: 1404.06297921 hartree
cpcmener: -0.04277228 hartree
kineticenergy: 1063.64562759 hartree
xcener: -80.305499847104 hartree
chargesum: 0.0000000
charge: -0.091093 -0.118011 -0.324801 -0.441107 -0.255414 0.060626 -0.003133 0.343692 -0.166344 -0.140218 -0.014369 -0.240196 -0.168475 0.192857 0.020687 0.112946 0.118032 0.121289 0.114194 0.116562 0.151362 0.129434 0.118518 0.120509 0.095655 0.146795
qa: -0.0911 -0.1180 -0.3248 -0.4411 -0.2554 0.0606 -0.0031 0.3437 -0.1663 -0.1402 -0.0144 -0.2402 -0.1685 0.1929 0.0207 0.1129 0.1180 0.1213 0.1142 0.1166 0.1514 0.1294 0.1185 0.1205 0.0957 0.1468
va: 1.2104 3.2898 3.0488 2.9125 3.1258 3.7462 3.6302 3.8582 3.8953 3.9793 4.0946 3.9643 3.9823 4.1235 4.3695 1.0177 0.9952 0.9970 0.9842 0.9935 0.9989 1.0106 0.9954 0.9948 1.0239 1.0046
dispcorr: -0.011330723 hartree
energy: -1066.966978487077
dipole: 21.37390 -20.20869 1.16521 -16.91256 11.92074 -4.99182 -4.95696 2.48087 -2.47609
magnitude: 5.69271 au
magnitude: 14.46972 debye
