program: Orca
programVersion: 5.0.3
elementType: Cl N N N N C C C C C C C C C C H H H H H H H H H H H
charge: 0
multiplicity: 1
keywords: wb97x-d3
keywords: def2-TZVPP
keywords: def2/J RIJCOSX
keywords: DEFGRID2
keywords: scfconv7
keywords: smallprint printgap noloewdin
keywords: NOSOSCF
formula: C10H11ClN4
InChI: InChI=1/C10H11ClN4/c1-8(14-7-12)15(2)6-9-3-4-10(11)13-5-9/h3-5H,6H2,1-2H3
26 atoms
Cl -4.456403 0.863093 0.605955
N  1.76273 -1.177154 -0.29069
N  -1.896872 1.168243 0.26956
N  2.778452 0.84649 -0.162372
N  4.445143 2.450445 0.718387
C  0.922839 -0.694289 -1.376622
C  -0.46478 -0.340102 -0.915199
C  2.652745 -0.357106 0.300508
C  1.401796 -2.466165 0.254624
C  -1.559615 -1.152728 -1.182136
C  -0.701902 0.819071 -0.183052
C  3.449147 -0.897576 1.453061
C  -2.813641 -0.797107 -0.72051
C  -2.910198 0.380725 0.006349
C  3.679673 1.671477 0.333464
H  0.872478 -1.478857 -2.136087
H  1.411344 0.166501 -1.827314
H  0.592974 -2.397805 0.986524
H  2.250448 -2.957725 0.721465
H  1.064492 -3.111147 -0.555636
H  -1.438964 -2.061958 -1.759695
H  0.112574 1.49897 0.042512
H  4.063179 -1.744521 1.144468
H  2.798248 -1.234438 2.260092
H  4.112516 -0.13507 1.852933
H  -3.684703 -1.405279 -0.915866
totalener: -1066.92592986 hartree
nucrepener: 1017.01414061 hartree
electener: -2083.94007047 hartree
oneelecener: -3474.75653644 hartree
twoeener: 1390.81646596 hartree
kineticenergy: 1063.68185783 hartree
xcener: -80.306495297185 hartree
chargesum: -0.0000000
charge: -0.060104 -0.117122 -0.255495 -0.413284 -0.107737 -0.038767 -0.027887 0.335701 -0.204725 -0.148787 0.002086 -0.259838 -0.147637 0.177035 -0.036808 0.116639 0.134667 0.127424 0.118994 0.100909 0.116711 0.140248 0.099841 0.108669 0.113417 0.125848
qa: -0.0601 -0.1171 -0.2555 -0.4133 -0.1077 -0.0388 -0.0279 0.3357 -0.2047 -0.1488 0.0021 -0.2598 -0.1476 0.1770 -0.0368 0.1166 0.1347 0.1274 0.1190 0.1009 0.1167 0.1402 0.0998 0.1087 0.1134 0.1258
va: 1.2397 3.1762 3.0830 2.9182 3.1373 3.7950 3.5674 3.8303 3.9203 4.0044 4.0517 3.9664 3.9968 4.1533 4.3002 0.9939 1.0356 0.9789 0.9964 0.9976 1.0118 1.0157 0.9989 0.9960 1.0325 1.0135
dispcorr: -0.011261818 hartree
energy: -1066.937191682327
dipole: 17.52570 -18.26214 -0.73644 -15.71446 12.21474 -3.49971 -1.16370 0.53945 -0.62424
magnitude: 3.63043 au
magnitude: 9.22782 debye
