program: Gaussian 09
title: 000058560
version: EM64L-G09RevD.01
frameworkgroup: C1[X(C17H20N2O)]
method: RPBEPBE
basis: SDD
operation: Freq
keyword: #p
keyword: freq=noraman
keyword: PBEPBE/SDD
title: #p freq=noraman PBEPBE/SDD
converged: YES YES NO NO
title: Mulliken charges:
elementType: O N N C C C C C C C C C C C C C C C C C H H H H H H H H H H H H H H H H H H H H
charge: -0.270378 -0.082561 -0.088642 -0.365030 -0.259541 0.260623 0.234283 -0.613285 -0.616193 -0.359419 -0.355921 -0.230642 -0.366964 -0.247943 0.265808 -0.350387 -0.378239 -0.220524 -0.203792 -0.251489 0.177064 0.225855 0.212499 0.203365 0.232020 0.185990 0.224860 0.231399 0.186808 0.217979 0.246494 0.279698 0.225344 0.257956 0.229326 0.240556 0.250092 0.221792 0.225125 0.226013
chargesum: 0.00000
title: Mulliken charges with hydrogens summed into heavy atoms:
elementType: O N N C C C C C C C C C C C C C C C C C
charge: -0.270378 -0.082561 -0.088642 0.037889 0.156323 0.260623 0.234283 0.029586 0.019993 -0.112925 -0.076223 -0.005298 -0.109008 -0.018618 0.265808 -0.109831 -0.128147 0.001268 0.021333 -0.025476
polarizability: 3.11911943e+02 -6.04413227e+01 2.45080687e+02 1.87317434e+01 2.17660806e+01 1.27455454e+02
1716.lowfreq: -12.0540 -7.2594 -0.0009 -0.0008 -0.0007 1.0192 12.1384 19.1586 29.0192
frequency: 11.5387 18.8992 28.9921 37.1389 50.2124 60.0079 110.1923 124.6297 136.3383 180.8680 199.8081 205.1063 222.5764 240.1465 252.1518 275.9299 280.5633 316.1305 373.4231 407.6817 413.2168 417.9944 463.8892 477.5179 502.6532 528.9390 538.3572 549.6377 601.8596 611.3656 646.2868 694.5334 738.2974 754.2246 759.0338 763.5671 770.1369 816.5853 836.5598 858.6553 859.7143 897.2905 910.4792 950.2105 955.9119 967.0304 981.0668 987.1137 989.0607 999.4740 1011.4940 1019.3718 1037.0029 1040.9199 1049.9546 1078.7465 1083.9053 1092.5137 1096.6753 1132.4742 1164.1249 1170.0351 1170.7713 1175.4937 1186.8016 1207.2737 1239.5810 1240.8217 1275.4800 1287.2245 1299.0755 1308.6894 1340.5199 1364.5025 1374.5639 1379.8858 1397.1370 1419.9918 1435.8749 1436.4254 1440.9006 1456.2008 1460.9758 1462.2151 1469.3724 1474.2996 1475.6566 1484.5393 1485.6667 1571.7736 1575.6537 1585.3145 1607.6141 1614.1369 2831.2210 2839.5068 2858.2388 2958.6755 3017.1048 3019.3993 3021.6656 3023.6653 3048.0418 3077.7317 3082.4044 3120.1479 3129.5889 3130.6174 3141.7314 3147.7021 3154.5533 3162.4368 3167.2773 3171.8103
redmass: 3.2931 3.8076 3.1131 4.1872 3.9374 4.7839 3.9243 4.0212 4.2169 4.7445 2.6190 1.4180 1.1668 4.6405 2.5231 3.4072 2.2944 4.2789 1.8905 2.9899 2.1940 4.0070 3.2908 3.6223 4.0387 3.9043 4.8915 3.6388 5.3487 6.4466 5.4942 1.8476 2.8500 2.4526 4.0412 1.6305 1.9141 5.4372 1.2901 3.7164 1.4387 3.3281 1.5258 1.7382 1.5336 1.3860 3.2588 1.3156 1.6043 1.5897 3.0697 2.1414 1.4722 2.0277 1.8812 1.5296 1.8260 1.5110 2.3962 1.4239 1.4013 1.1558 1.1435 1.5030 1.5238 2.3903 1.4322 2.2982 2.4181 1.6541 1.4966 1.3792 1.8967 1.3563 4.3277 1.5729 3.8453 1.1412 1.3949 1.7399 2.2937 1.1673 1.2275 1.1353 1.5069 1.1625 1.0858 1.2624 1.6487 6.8985 5.9769 6.3878 6.4731 6.2191 1.0692 1.0577 1.0592 1.0571 1.0875 1.0931 1.0762 1.0766 1.0891 1.1007 1.1007 1.0847 1.0874 1.0859 1.0935 1.0898 1.0957 1.0941 1.1005 1.0991
irintensity: 0.4572 0.0109 0.3622 0.3270 0.8646 1.3616 1.0110 0.5747 0.0966 0.6468 8.9896 3.7657 0.8444 2.4907 0.9236 4.8617 10.8186 1.2449 5.8755 1.1385 0.1013 5.2153 9.8617 6.0965 5.3071 12.4444 6.6588 6.9533 13.4120 0.0076 5.0974 45.3393 8.5936 45.9096 0.9595 49.5267 79.2536 2.2117 4.2412 15.7400 0.8627 33.4559 9.7423 21.7013 19.7454 0.3739 4.8712 1.2440 1.1839 14.6049 38.0732 7.2952 12.9435 16.0386 21.1757 10.9607 9.7237 8.4213 31.3068 7.1780 18.3777 35.4650 7.5590 9.7832 12.3363 114.6193 24.9573 122.5355 14.0769 29.6914 14.4786 6.0047 19.3165 8.2590 0.5423 1.7375 61.9063 4.9779 7.7111 7.1366 56.1747 22.0956 33.1478 4.9049 14.6502 40.7296 24.4886 29.7280 15.8334 77.7527 23.9056 67.6041 30.5217 28.7141 63.1758 84.2801 284.2268 73.5220 26.5233 17.1812 24.8085 61.0113 28.2815 20.0101 51.6171 6.1878 2.9850 2.0720 24.8209 11.4821 32.8903 20.3645 27.8094 26.9996
temp: 298.150 k
press: 1.00000 atm
elementType: 8 7 7 6 6 6 6 6 6 6 6 6 6 6 6 6 6 6 6 6 1 1 1 1 1 1 1 1 1 1 1 1 1 1 1 1 1 1 1 1
symmnumber: 1
zpe: 864649.9 jmol-1
zpe.correction: 0.329328 hartree
zpe.thermalcorrener: 0.348771 hartree
zpe.thermalcorrenthalpy: 0.349715 hartree
zpe.thermalcorrgfe: 0.277611 hartree
zpe.sumelectzpe: -843.026343 hartree
zpe.sumelectthermal: -843.006899 hartree
zpe.sumelectthermalent: -843.005955 hartree
zpe.sumelectthermalfe: -843.078060 hartree
dipole: -4.0105 -1.8538 -0.7264
dipole: 4.4775
quadrupole: -101.2282 -108.0485 -119.8332
quadrupole: -3.0659 4.0787 4.2789
quadrupole: 8.4751 1.6548 -10.1299 -3.0659 4.0787 4.2789
hfenergy: -843.3556706 hartree
pointgroup: C01 [X(C17H20N2O1)]
dipole: 1.0020102 1.4344735 -0.2036513 debye
polarizability: 346.7669384|3.1975301|209.2996715|14.0392596|-28.319331|128.3814738 unknown
InChI: InChI=1S/C17H20N2O/c1-19(2)12-13-20-17-11-7-6-8-15(17)14-18-16-9-4-3-5-10-16/h3-11,14H,12-13H2,1-2H3
charge 0 multiplicity 1
40 atoms
O  1.583127 0.903697 -0.304126
N  1.092941 3.791766 0.597007
N  -1.338534 -1.946459 0.106838
C  1.794223 3.296797 -0.604066
C  2.568213 1.99704 -0.363708
C  2.036564 -0.384866 0.001545
C  1.025295 -1.389728 0.139473
C  -0.112128 4.583884 0.28766
C  1.982985 4.470612 1.55596
C  3.404618 -0.718379 0.162768
C  1.426997 -2.720646 0.431419
C  3.770933 -2.049804 0.457117
C  -0.39484 -1.039371 -0.010907
C  2.784641 -3.056547 0.591113
C  -2.702232 -1.617252 -0.11542
C  -3.13707 -0.683796 -1.102868
C  -3.679111 -2.312742 0.650259
C  -4.513454 -0.439182 -1.292468
C  -5.051716 -2.049846 0.467427
C  -5.477519 -1.111398 -0.504145
H  2.511475 4.055102 -1.016483
H  1.047605 3.098761 -1.394478
H  3.140974 2.034901 0.584145
H  3.272919 1.810601 -1.201285
H  -0.796608 3.990062 -0.34311
H  0.103881 5.547841 -0.241044
H  -0.643015 4.826788 1.225649
H  1.42077 4.714277 2.474638
H  2.422094 5.421298 1.155014
H  2.817965 3.808314 1.846222
H  4.183025 0.042327 0.056873
H  0.633792 -3.46865 0.531269
H  4.831141 -2.298887 0.579576
H  -0.613032 0.028378 -0.197024
H  3.076259 -4.086906 0.818948
H  -2.3976 -0.183702 -1.739537
H  -3.333056 -3.046738 1.385186
H  -4.83668 0.269569 -2.06387
H  -5.791952 -2.583982 1.073911
H  -6.545393 -0.919434 -0.656078
