program: Gaussian 09
title: 000006575
version: EM64L-G09RevD.01
frameworkgroup: C1[X(C2HCl3)]
method: RPBEPBE
basis: SDD
operation: Freq
keyword: #pfreq=noraman
keyword: PBEPBE/SDD
title: #p freq=noraman PBEPBE/SDD
converged: NO NO NO NO
title: Mulliken charges:
elementType: Cl Cl Cl C C H
charge: 0.052583 0.058859 0.025181 -0.170789 -0.258127 0.292293
chargesum: 0.00000
title: Mulliken charges with hydrogens summed into heavy atoms:
elementType: Cl Cl Cl C C
charge: 0.052583 0.058859 0.025181 -0.170789 0.034167
polarizability: 7.28952531e+01 -2.40285488e+00 5.12430949e+01 -8.00907537e-04 -1.38765045e-03 1.66883395e+01
1716.lowfreq: -9.2414 -8.6341 -0.0031 -0.0028 0.0011 21.3605 155.2109 186.0150 255.0868
frequency: 155.2108 186.0111 255.0837 356.1581 419.9951 565.6771 762.9777 768.9968 843.7236 1230.5512 1607.9104 3195.4109
redmass: 25.8989 6.6549 22.4698 27.0149 6.1941 9.9221 1.2589 10.3243 7.0717 1.1338 9.7837 1.0938
irintensity: 1.1144 0.2953 0.3664 0.1270 6.4977 20.3489 49.9034 112.4642 111.4649 7.6238 14.8416 11.4009
temp: 298.150 k
press: 1.00000 atm
elementType: 17 17 17 6 6 1
symmnumber: 1
zpe: 61893.0 jmol-1
zpe.correction: 0.023574 hartree
zpe.thermalcorrener: 0.029190 hartree
zpe.thermalcorrenthalpy: 0.030134 hartree
zpe.thermalcorrgfe: -0.007316 hartree
zpe.sumelectzpe: -1456.564978 hartree
zpe.sumelectthermal: -1456.559362 hartree
zpe.sumelectthermalent: -1456.558418 hartree
zpe.sumelectthermalfe: -1456.595868 hartree
dipole: 0.1026 -1.1299 0.0001
dipole: 1.1346
quadrupole: -50.7580 -46.1501 -50.3293
quadrupole: -0.1154 -0.0001 -0.0002
quadrupole: -1.6789 2.9290 -1.2501 -0.1154 -0.0001 -0.0002
hfenergy: -1456.5885523 hartree
pointgroup: C01 [X(C2H1Cl3)]
dipole: -0.0267221 0.445578 0.0000421 debye
dipolederiv: -0.6690006 0.2379938 0.0000172 0.2554912 -0.2738863 -0.0000203 0.0000337 -0.0000204 0.030566 -0.1157547 0.0666392 0.0000058 -0.0234533 -0.7033831 -0.0000418 0.0000035 -0.000027 0.0439166 -0.6583636 0.003776 -0.0000303 0.217004 -0.0607024 0.0000063 -0.0000651 -0.0000066 0.0001531 0.8014779 -0.3008419 -0.0000492 -0.1582575 1.2070209 0.0000777 -0.0000595 0.0000552 -0.122046 0.654776 -0.028899 0.0000707 -0.3555096 -0.2016575 -0.0000084 0.0001126 0.0000269 -0.1865841 -0.0131351 0.0213318 -0.0000143 0.0647251 0.0326084 -0.0000134 -0.0000253 -0.0000282 0.2339944 unknown
polarizability: 72.7276572|-3.0617702|51.4106908|0.0008431|0.0013624|16.6883395 unknown
InChI: InChI=1S/C2HCl3/c3-1-2(4)5/h1H
charge 0 multiplicity 1
6 atoms
Cl -2.085807 0.75123 0.000076
Cl -0.400118 -1.782081 -0.000074
Cl 2.332812 0.183512 0.000142
C  -0.446341 0.013861 0.000002
C  0.652198 0.802071 0.00003
H  0.572355 1.891407 0.000124
