program: Gaussian 09
title: 000058521
version: EM64L-G09RevD.01
frameworkgroup: C1[X(C24H29N3O4)]
method: RPBEPBE
basis: SDD
operation: Freq
keyword: #p
keyword: freq=noraman
keyword: PBEPBE/SDD
title: #p freq=noraman PBEPBE/SDD
converged: YES YES NO NO
title: Mulliken charges:
elementType: O O O O N N N C C C C C C C C C C C C C C C C C C C C C C C C H H H H H H H H H H H H H H H H H H H H H H H H H H H H H
charge: -0.210080 -0.236712 -0.263353 -0.262247 -0.075518 -0.183297 -0.454255 -0.054435 -0.358829 -0.369873 -0.341051 -0.394118 -0.387311 -0.399141 -0.385009 0.095540 0.169388 0.427837 0.461233 -0.422803 -0.401304 -0.318761 -0.368653 -0.359171 -0.369214 -0.362574 -0.366083 0.315117 0.317074 -0.537793 -0.537825 0.176696 0.213366 0.167073 0.216584 0.231074 0.208070 0.204935 0.192245 0.204588 0.191482 0.213574 0.188778 0.243919 0.252000 0.333402 0.257103 0.249907 0.262567 0.254953 0.241008 0.242918 0.251535 0.252586 0.222098 0.246709 0.220545 0.247034 0.223524 0.222946
chargesum: 0.00000
title: Mulliken charges with hydrogens summed into heavy atoms:
elementType: O O O O N N N C C C C C C C C C C C C C C C C C C C C C C C C
charge: -0.210080 -0.236712 -0.263353 -0.262247 -0.075518 -0.183297 -0.120853 -0.054435 0.031233 0.013784 0.098093 0.003062 0.008759 0.003211 0.110910 0.095540 0.169388 0.427837 0.461233 -0.165700 -0.151396 -0.056194 -0.113700 -0.118163 -0.126296 -0.111038 -0.113496 0.315117 0.317074 0.151560 0.155680
polarizability: 3.31926097e+02 1.53443974e+01 3.27611334e+02 2.12373987e+01 1.17870999e+01 2.36755849e+02
1716.lowfreq: -11.9966 -6.6430 -0.0011 -0.0010 0.0005 2.7134 7.5973 11.2877 16.5789
frequency: -6.7459 10.1780 16.3537 22.3982 27.1259 43.1104 47.9839 58.9502 66.1374 83.5323 94.7131 102.7062 111.8564 137.6922 154.1781 167.0734 181.7104 191.4399 210.7092 222.0813 232.4935 234.2577 244.1696 260.5676 280.8475 296.3877 298.0614 319.6018 339.5807 353.2218 372.0743 382.1558 389.3881 402.8481 411.3299 416.7905 446.1495 450.4717 460.3833 476.4104 483.9204 518.8233 528.7831 549.5348 560.3012 586.3735 600.5829 626.5923 632.1885 666.1135 671.1401 704.7302 717.5124 734.4974 741.1060 757.9879 769.8732 774.0646 785.3071 802.8083 814.1067 816.0269 833.2458 837.0342 851.6424 855.2928 865.2348 904.4529 909.3926 943.2903 948.1734 957.0782 967.0646 969.1842 977.0916 986.9742 988.4991 993.1775 1002.9766 1005.3296 1040.1913 1049.3007 1051.9823 1071.5697 1088.1664 1106.5256 1110.9499 1113.5360 1118.4853 1118.7026 1122.8015 1143.6544 1152.0818 1156.5837 1157.5451 1160.1571 1172.7041 1185.8665 1188.3208 1209.0074 1217.7557 1231.5498 1236.8922 1240.8319 1257.7836 1265.7091 1285.4065 1295.2645 1301.0544 1309.3849 1316.2151 1326.9110 1331.3738 1340.6090 1342.1478 1346.0389 1351.7465 1366.4126 1370.6546 1375.8888 1377.7493 1393.4372 1416.4722 1421.3302 1435.0187 1437.3833 1446.7757 1450.3323 1457.8035 1462.9248 1466.0884 1466.8895 1467.8628 1471.9799 1472.6893 1474.5852 1483.1705 1496.9000 1501.6323 1580.2212 1583.1532 1620.4154 1622.7659 1644.2580 1708.2870 2821.9532 2831.8212 2880.2319 2959.4209 2962.0435 2966.7252 2985.1744 2985.9339 3026.3725 3031.6782 3033.5563 3038.1693 3039.9986 3045.6554 3047.0100 3050.7604 3055.0438 3106.3656 3126.1363 3127.9714 3128.6609 3139.7440 3146.8297 3147.7653 3163.8579 3166.5352 3169.7641 3171.8029 3600.5944
redmass: 3.1309 5.0707 4.1106 3.5481 4.5521 4.8683 3.8543 4.5101 5.0763 4.2725 3.5316 3.8182 4.4944 8.6358 4.4021 3.8647 3.7349 3.0937 2.8143 2.3197 1.4539 1.5295 1.7526 2.7310 4.2613 5.7280 4.4075 2.5330 4.5600 5.7264 2.2619 5.1785 3.6791 3.2717 2.9446 3.0898 2.8794 3.5803 3.4444 3.2874 1.3102 3.1586 2.8560 3.0680 2.5056 5.0438 7.4152 6.8681 7.0507 5.6318 4.3726 5.3380 7.7415 4.5653 3.5119 2.8510 5.6899 4.0090 1.8162 1.4725 1.3432 1.3559 1.6915 1.6110 1.6692 2.1294 3.6564 2.4071 6.0314 1.4107 1.4540 1.3134 1.3761 1.3532 2.8766 8.6599 7.0124 2.5462 2.6823 2.5982 3.1011 2.6124 2.2075 2.6031 2.7182 2.1076 1.2609 1.2598 2.3932 1.4310 1.5046 1.3902 1.4868 1.3400 1.3263 2.4156 1.4024 1.6682 1.8402 3.5926 2.6998 3.4907 3.0190 2.7559 1.2824 1.1812 1.3676 1.4410 1.2837 1.2859 1.3843 1.4082 1.3169 1.4752 1.8260 1.4809 1.5064 2.2822 4.2606 4.8563 1.8785 1.4205 4.0494 3.7544 1.1713 1.1661 1.1051 1.0919 1.0882 1.0866 1.0504 1.0877 1.0498 1.0817 1.0733 1.0904 1.0948 2.3450 2.3927 7.1393 7.3018 6.3654 6.3768 11.4106 9.8494 1.0716 1.0702 1.0699 1.0330 1.0330 1.0625 1.0607 1.0619 1.0887 1.0918 1.0727 1.0895 1.0765 1.1033 1.1039 1.1041 1.1036 1.1057 1.0992 1.0994 1.0895 1.0878 1.0878 1.0885 1.0947 1.0947 1.0957 1.0967 1.0800
irintensity: 0.1103 0.0895 0.1848 1.6847 1.0579 0.2036 0.0714 0.3454 0.1479 0.7915 1.4319 4.2162 0.6248 8.5628 3.9880 4.0732 1.4330 0.3547 1.1803 0.4626 0.6440 0.1569 0.2399 2.4406 5.3407 1.9864 3.0543 4.8809 8.2022 1.6245 6.0331 0.7433 8.1643 17.1438 0.3220 2.1836 0.9008 3.4508 8.1652 6.0143 142.2671 6.0774 27.2708 44.8513 21.4517 21.9183 24.4770 2.2799 0.8132 1.1594 3.1186 25.7170 14.6324 7.3399 15.6742 1.6752 1.8258 2.1246 8.3607 0.3114 15.7033 23.0203 44.5243 60.4510 2.2927 8.1039 3.3615 7.8028 19.9412 0.9565 1.3253 2.0917 1.2788 1.6061 15.3006 75.8356 14.6985 18.3553 6.4561 16.3198 7.9883 1.4590 9.0400 3.0140 67.5400 49.0213 0.1173 0.2364 13.0309 1.2954 27.5547 9.2954 1.2824 1.6193 2.9334 39.7140 103.8395 110.9514 23.9833 4.7847 23.7212 179.2914 186.2679 22.4722 8.5886 5.3111 35.1032 15.9863 2.2138 1.1765 50.7778 13.9039 3.6844 5.8207 70.1074 1.2728 10.1619 97.8159 37.3801 15.6779 129.0731 29.2472 5.0362 5.0359 11.2486 10.3059 37.2879 7.0860 12.0801 5.9640 13.2277 8.6359 14.1513 96.0823 32.6710 1.8331 11.4775 126.5771 104.1796 13.1489 24.3109 97.6971 74.7362 428.9471 292.3898 43.3251 122.1217 96.8081 73.7489 64.3365 38.8081 39.4936 30.9978 40.2922 89.8744 9.1373 6.8677 40.1257 16.2101 46.7528 44.5970 95.8717 3.7081 27.7129 28.3217 6.9705 3.9064 7.1297 6.2572 14.8503 10.3504 4.8354 3.3370 45.1454
temp: 298.150 k
press: 1.00000 atm
elementType: 8 8 8 8 7 7 7 6 6 6 6 6 6 6 6 6 6 6 6 6 6 6 6 6 6 6 6 6 6 6 6 1 1 1 1 1 1 1 1 1 1 1 1 1 1 1 1 1 1 1 1 1 1 1 1 1 1 1 1 1
symmnumber: 1
zpe: 1289574.9 jmol-1
zpe.correction: 0.491173 hartree
zpe.thermalcorrener: 0.519909 hartree
zpe.thermalcorrenthalpy: 0.520854 hartree
zpe.thermalcorrgfe: 0.428429 hartree
zpe.sumelectzpe: -1394.813669 hartree
zpe.sumelectthermal: -1394.784933 hartree
zpe.sumelectthermalent: -1394.783989 hartree
zpe.sumelectthermalfe: -1394.876413 hartree
dipole: -1.1701 1.1691 -0.1640
dipole: 1.6622
quadrupole: -170.1334 -150.0001 -193.7330
quadrupole: 15.1458 -3.6505 19.2333
quadrupole: 1.1554 21.2888 -22.4441 15.1458 -3.6505 19.2333
hfenergy: -1395.3048423 hartree
pointgroup: C01 [X(C24H29N3O4)]
dipole: -0.4978808 0.416804 -0.0776921 debye
polarizability: 329.039908|15.9245444|330.8993703|20.2564355|11.3044636|236.3540021 unknown
InChI: InChI=1S/C24H29N3O4/c1-30-20-10-6-18(7-11-20)24(19-8-12-21(31-2)13-9-19)22(28)27(23(29)25-24)17-16-26-14-4-3-5-15-26/h6-13,25H,3-5,14-17H2,1-2H3
charge 0 multiplicity 1
60 atoms
O  0.360994 -0.729119 -1.538949
O  1.227242 -1.053976 3.072877
O  -2.054699 5.284482 -1.175186
O  -5.758555 -3.538656 -0.326018
N  4.851672 -0.507004 0.056726
N  1.135987 -0.93607 0.684531
N  -0.692357 -0.34336 1.855044
C  -1.116488 -0.185562 0.441269
C  5.052116 -0.608237 -1.412515
C  5.898119 0.336265 0.690213
C  3.476962 -0.104111 0.421164
C  6.429914 -1.216757 -1.742866
C  7.304082 -0.241119 0.427017
C  7.56163 -0.390004 -1.09007
C  2.526674 -1.328369 0.417066
C  0.188399 -0.644872 -0.298275
C  0.606346 -0.798133 2.012215
C  -1.375629 1.290919 0.071982
C  -2.322942 -1.093724 0.136713
C  -1.035424 2.347746 0.942991
C  -2.186473 -2.366998 -0.459695
C  -1.916861 1.60405 -1.20444
C  -3.617512 -0.675342 0.550008
C  -1.246414 3.696985 0.574533
C  -3.302538 -3.215102 -0.638546
C  -2.126809 2.937728 -1.587091
C  -4.735589 -1.508449 0.387312
C  -1.796518 3.991947 -0.696114
C  -4.581831 -2.787156 -0.207436
C  -1.725952 6.410264 -0.297505
C  -5.657097 -4.865643 -0.94003
H  4.971752 0.403456 -1.893004
H  4.249126 -1.232851 -1.844259
H  5.859617 1.390221 0.304225
H  5.701821 0.374461 1.777721
H  3.48794 0.319799 1.4419
H  3.066694 0.679483 -0.262508
H  6.461708 -2.255525 -1.361112
H  6.559551 -1.257276 -2.841623
H  7.375602 -1.232992 0.913796
H  8.064161 0.417108 0.890618
H  8.544351 -0.864829 -1.272107
H  7.596666 0.616354 -1.557487
H  2.542419 -1.830855 -0.564972
H  2.845374 -2.04022 1.196055
H  -1.342238 -0.305611 2.63833
H  -0.598496 2.121956 1.921324
H  -1.207431 -2.705649 -0.81333
H  -2.164404 0.794394 -1.898375
H  -3.751451 0.321002 0.987382
H  -0.978506 4.493176 1.275338
H  -3.16287 -4.191042 -1.112547
H  -2.541199 3.190817 -2.567476
H  -5.734611 -1.193233 0.7028
H  -0.643116 6.438712 -0.067001
H  -2.007591 7.30878 -0.865617
H  -2.305017 6.368259 0.645741
H  -6.681088 -5.266242 -0.927016
H  -5.295419 -4.79894 -1.984445
H  -4.989094 -5.528635 -0.356676
