program: Gaussian 09
title: 000058459
version: EM64L-G09RevD.01
frameworkgroup: C1[X(C19H22N2O2)]
method: RPBEPBE
basis: SDD
operation: Freq
keyword: #p
keyword: freq=noraman
keyword: PBEPBE/SDD
title: #p freq=noraman PBEPBE/SDD
converged: YES YES NO NO
title: Mulliken charges:
elementType: O O N N C C C C C C C C C C C C C C C C C C C H H H H H H H H H H H H H H H H H H H H H H
charge: -0.304532 -0.286723 -0.052820 -0.354357 0.048341 -0.434256 -0.422978 -0.393433 -0.398878 -0.617182 0.254040 0.349594 0.397942 -0.354090 -0.339319 -0.348356 -0.340959 -0.239045 -0.215402 -0.225610 -0.215449 -0.252970 -0.237995 0.228107 0.206068 0.224850 0.215368 0.235488 0.219772 0.175672 0.180877 0.218810 0.223791 0.224867 0.187358 0.258594 0.254726 0.310104 0.254736 0.223719 0.229978 0.224569 0.229712 0.227053 0.230216
chargesum: 0.00000
title: Mulliken charges with hydrogens summed into heavy atoms:
elementType: O O N N C C C C C C C C C C C C C C C C C C C
charge: -0.304532 -0.286723 -0.052820 -0.354357 0.276448 -0.003338 0.027878 0.002011 0.000809 0.018834 0.254040 0.349594 0.397942 -0.095496 -0.084593 -0.038252 -0.086223 -0.015326 0.014576 -0.001041 0.014263 -0.025916 -0.007780
polarizability: 2.69074703e+02 -1.26040025e+01 2.44989105e+02 2.52718828e+00 3.58543934e-01 1.58006475e+02
1716.lowfreq: -30.0036 -3.0455 0.0005 0.0007 0.0010 2.1522 10.8379 17.7230 30.3173
frequency: -24.9391 15.5918 30.1656 39.4282 55.5773 67.3300 81.1503 100.5893 114.2445 186.1076 187.8412 206.9143 214.1231 238.5173 245.2291 267.9286 307.8225 317.2559 342.9909 363.7240 372.6723 407.1679 410.1628 430.1938 431.2677 464.3643 478.7827 517.8265 526.4172 583.2906 614.4835 615.5289 644.8680 660.3638 691.2859 695.9934 699.2222 739.1021 745.9265 763.6272 778.9906 815.5289 836.7712 844.3067 850.2452 888.9348 919.9226 920.3986 924.5821 944.4769 975.1323 978.8145 979.4862 983.3383 988.1754 990.2140 995.6146 997.7010 1009.3772 1025.2701 1034.0526 1036.2582 1067.2880 1075.5335 1089.7805 1094.7251 1124.6931 1132.1079 1142.2963 1148.0204 1162.9949 1171.5671 1173.8655 1179.6633 1200.5026 1205.0039 1250.0883 1261.6225 1269.3177 1276.7847 1283.7725 1306.2363 1309.3107 1312.2389 1330.9658 1338.1826 1357.0719 1358.9919 1376.7688 1377.6576 1379.7469 1431.0928 1437.1046 1444.3023 1450.1416 1461.6487 1462.1801 1464.1107 1478.2454 1481.0081 1482.1581 1482.3559 1586.0411 1596.5234 1603.8761 1609.5619 1624.4217 2815.2121 2826.2731 2857.3413 3003.4395 3007.8216 3012.2110 3018.1146 3029.8113 3035.5000 3075.6015 3076.5042 3083.5171 3126.5009 3129.2988 3136.9146 3138.0297 3150.3760 3158.5157 3159.1180 3170.1464 3175.8953 3203.4613
redmass: 3.1045 3.7508 5.0652 4.4082 3.7600 4.4438 6.2587 5.9959 4.4180 3.9635 4.9786 1.3884 4.2185 1.4344 3.5021 3.8030 5.0661 3.5051 2.0228 3.4275 5.5028 2.8757 2.9270 5.2419 3.8907 2.6929 2.9998 3.8153 3.5705 3.1433 6.5357 6.2522 4.4713 6.9521 11.1938 2.1175 1.8383 4.1667 3.3693 1.6401 2.3379 1.4687 2.6200 1.2499 1.2466 3.4176 1.4224 1.7421 1.5558 5.4270 1.3780 1.3552 1.4349 5.6187 4.1613 6.2476 1.3283 1.2975 3.6706 2.0310 2.3415 2.1753 1.6824 1.5266 1.5532 1.5840 1.9894 1.9462 1.4259 2.1537 2.3946 1.0548 1.0724 1.2558 1.1955 1.5767 2.6605 1.5962 1.8290 1.4634 3.2515 1.3344 1.4228 1.3207 1.3943 1.3788 1.4547 1.6537 1.4011 8.8831 8.4852 1.1716 2.2072 2.4310 1.0938 1.0612 1.0745 1.0910 1.1069 2.4367 1.0569 2.2122 6.2937 6.5807 6.7538 6.2929 8.9863 1.0717 1.0693 1.0576 1.0804 1.0616 1.0664 1.0724 1.0849 1.0862 1.1034 1.1010 1.1036 1.0850 1.0848 1.0907 1.0885 1.0929 1.0972 1.0968 1.1017 1.0956 1.0937
irintensity: 0.0507 0.0963 1.2617 0.8357 0.0015 0.0710 1.0152 0.6199 0.5586 0.5255 0.7515 0.1486 0.1110 0.8575 9.3120 2.4760 1.4132 7.6378 5.3798 7.8961 1.4622 0.0054 0.0403 2.1172 7.7589 0.0897 0.5971 15.1394 9.8550 6.3980 0.9476 0.0816 13.6271 8.8559 10.0553 26.2411 53.8530 1.7393 10.8763 78.5516 34.0969 0.5735 0.7141 1.0949 0.0810 4.5515 5.0865 2.1627 4.3411 1.9132 0.3140 0.1995 6.8460 24.5298 78.7048 3.9794 0.3500 1.9996 317.0980 32.3579 17.6752 9.0958 24.8036 11.0983 8.2651 14.9871 3.7851 6.6457 0.5415 16.8371 195.1851 0.0118 6.0266 37.5345 38.8870 0.3757 172.4482 1.5181 31.2412 7.4029 544.2419 0.0107 41.4590 70.9877 30.3106 0.7215 4.3821 4.4857 2.9479 1.1532 4.3432 2.9803 6.1766 19.9696 6.2292 18.6030 1.9443 13.8048 13.4712 62.7290 6.6574 128.4218 2.6480 2.8605 107.6434 123.2046 158.4715 54.5352 91.8910 208.5902 2.8475 9.8402 31.3490 46.0046 64.6100 30.2655 14.6581 40.3745 28.9010 0.6284 0.4794 21.6905 4.9395 25.2938 20.0581 36.8081 12.2420 7.1118 12.3685
temp: 298.150 k
press: 1.00000 atm
elementType: 8 8 7 7 6 6 6 6 6 6 6 6 6 6 6 6 6 6 6 6 6 6 6 1 1 1 1 1 1 1 1 1 1 1 1 1 1 1 1 1 1 1 1 1 1
symmnumber: 1
zpe: 973962.7 jmol-1
zpe.correction: 0.370963 hartree
zpe.thermalcorrener: 0.390876 hartree
zpe.thermalcorrenthalpy: 0.391821 hartree
zpe.thermalcorrgfe: 0.320691 hartree
zpe.sumelectzpe: -995.487308 hartree
zpe.sumelectthermal: -995.467394 hartree
zpe.sumelectthermalent: -995.466450 hartree
zpe.sumelectthermalfe: -995.537580 hartree
dipole: -1.1230 2.2856 -0.1456
dipole: 2.5507
quadrupole: -122.4355 -128.4554 -132.4271
quadrupole: 5.8047 3.0342 -2.1472
quadrupole: 5.3371 -0.6827 -4.6544 5.8047 3.0342 -2.1472
hfenergy: -995.8582707 hartree
pointgroup: C01 [X(C19H22N2O2)]
dipole: -0.3371788 -0.9433854 -0.0584077 debye
polarizability: 265.7951567|14.580427|247.0880154|4.975089|10.0718941|159.1871114 unknown
InChI: InChI=1S/C19H22N2O2/c1-20-14-12-18(13-15-20)23-19(22)21(16-8-4-2-5-9-16)17-10-6-3-7-11-17/h2-11,18H,12-15H2,1H3
charge 0 multiplicity 1
45 atoms
O  -1.031939 -0.110895 0.110706
O  -0.471542 2.117873 0.555571
N  -5.207281 -0.145405 -0.727415
N  1.190592 0.460184 0.150734
C  -2.48005 0.258328 0.2239
C  -3.233452 -1.045815 0.504329
C  -2.976715 0.914554 -1.075076
C  -4.752309 -0.768539 0.538489
C  -4.502587 1.132449 -0.989543
C  -6.674297 0.005021 -0.778726
C  -0.120504 0.936715 0.294611
C  2.366272 1.299426 0.245924
C  1.378906 -0.964909 -0.108717
C  3.646256 0.698001 0.081914
C  1.430801 -1.435968 -1.438586
C  2.293124 2.70003 0.491229
C  1.539083 -1.855926 0.974868
C  4.818683 1.477759 0.159904
C  1.632776 -2.812356 -1.685224
C  3.477742 3.463515 0.564447
C  1.741105 -3.231653 0.72509
C  4.74798 2.86779 0.400984
C  1.787856 -3.712528 -0.604717
H  -2.579953 0.971802 1.065633
H  -2.903556 -1.479952 1.46582
H  -3.010591 -1.772487 -0.29753
H  -2.752049 0.244652 -1.925435
H  -2.466405 1.88071 -1.233921
H  -5.298563 -1.719624 0.678129
H  -4.990913 -0.116929 1.422611
H  -4.724493 1.892031 -0.1922
H  -4.871758 1.547174 -1.945611
H  -7.155312 -0.981765 -0.653537
H  -6.972827 0.407687 -1.76325
H  -7.078908 0.689125 0.01076
H  3.731757 -0.374685 -0.10775
H  1.30939 -0.728328 -2.265299
H  1.321644 3.175251 0.624844
H  1.502812 -1.469573 1.998883
H  5.791044 0.989348 0.029639
H  1.667505 -3.180585 -2.716397
H  3.397674 4.540183 0.753592
H  1.861332 -3.924942 1.564775
H  5.660332 3.470727 0.460085
H  1.944038 -4.779672 -0.797434
