program: Gaussian 09
title: 000058379
version: EM64L-G09RevD.01
frameworkgroup: C1[X(C13H21NO)]
method: RPBEPBE
basis: SDD
operation: Freq
keyword: #p
keyword: freq=noraman
keyword: PBEPBE/SDD
title: #p freq=noraman PBEPBE/SDD
converged: YES YES NO NO
title: Mulliken charges:
elementType: O N C C C C C C C C C C C C C H H H H H H H H H H H H H H H H H H H H H
charge: -0.271195 -0.327080 0.494679 -0.105233 -0.106864 -0.103502 -0.561568 -0.526959 -0.545261 -0.450946 -0.453103 -0.451628 -0.153659 -0.764660 -0.067696 0.195536 0.199235 0.196519 0.186296 0.203973 0.221196 0.208337 0.198825 0.206632 0.196965 0.191133 0.190986 0.198487 0.196345 0.196741 0.266870 0.236066 0.210255 0.234338 0.295322 0.164617
chargesum: 0.00000
title: Mulliken charges with hydrogens summed into heavy atoms:
elementType: O N C C C C C C C C C C C C C
charge: -0.271195 -0.031758 0.494679 0.090303 0.092371 0.093017 -0.171298 -0.097426 -0.139804 -0.062847 -0.063629 -0.058541 0.113211 -0.084002 0.096921
polarizability: 1.51134922e+02 5.55422503e+00 1.32970195e+02 -3.23600930e-01 2.13851470e+00 1.26910443e+02
1716.lowfreq: -30.1913 -7.3831 -0.0009 -0.0006 -0.0004 18.0421 39.5912 50.2648 146.1398
frequency: 37.8453 46.4167 146.1176 161.2981 183.9397 225.0378 235.1274 294.6680 301.2184 310.2458 340.2099 377.9296 395.8536 405.0721 420.0301 425.6011 450.1611 485.3994 576.5080 599.3255 637.2373 641.9764 684.5937 749.2073 770.7795 807.5547 811.4834 855.5161 868.4663 871.0815 873.6742 894.6712 932.2403 938.8319 961.6698 964.5766 967.8059 976.5101 1017.2583 1046.4983 1049.8132 1051.2056 1076.7641 1083.2639 1100.7900 1106.8438 1108.9224 1112.8068 1115.2000 1147.2934 1184.2363 1189.8224 1190.8494 1248.4266 1259.2507 1283.4457 1288.0425 1294.4079 1302.0917 1308.9265 1313.3595 1317.2038 1326.1414 1331.6366 1343.1359 1347.3141 1356.5469 1359.9638 1365.4654 1370.2105 1390.3607 1450.7499 1451.6804 1461.2021 1461.8949 1462.1887 1465.2258 1478.5920 1480.3500 1485.0598 1636.4459 2918.5657 2948.6871 2959.1766 2960.6013 2961.5201 2964.1131 2972.0390 2983.1609 2990.4378 2993.5108 3004.7469 3006.7128 3008.7693 3015.7788 3019.4854 3024.1628 3027.6465 3035.4738 3075.3550 3095.5425 3529.6721
redmass: 6.5267 3.8562 2.8057 2.6763 2.9450 1.4928 2.0968 1.9772 2.4159 2.4406 2.7685 3.0277 4.6207 3.2044 1.7843 1.7682 1.8469 3.0128 1.3998 2.3436 3.8550 3.8350 4.1301 4.8734 3.4406 2.7536 2.7559 2.1867 1.5908 1.5968 1.5698 2.5958 1.9918 2.1752 1.6134 2.0527 2.1919 2.2420 2.1632 1.8987 2.0635 1.7533 2.4278 2.0786 1.5892 1.2396 1.0652 1.3161 1.0388 2.1853 1.5313 1.3570 1.6186 1.4997 1.6016 1.8006 1.8372 1.8574 2.1540 1.4332 1.5817 1.5216 1.3145 1.4118 1.4500 1.4313 1.4234 1.5650 1.3551 1.3996 1.2161 1.0839 1.0831 1.2796 1.0982 1.2467 1.1030 1.0904 1.0833 1.1020 5.7223 1.0859 1.0600 1.0632 1.0602 1.0615 1.0617 1.0615 1.0397 1.0836 1.0834 1.0849 1.0834 1.0984 1.1024 1.1026 1.1010 1.1022 1.1014 1.0974 1.0986 1.0774
irintensity: 8.5644 2.9875 5.2626 8.3210 5.2415 4.9402 25.0199 0.0662 0.3375 6.4795 2.6067 3.0562 0.0427 1.7286 0.6777 2.1762 1.3203 4.0924 53.7072 62.5899 0.0511 0.0072 0.4901 3.2356 2.6324 1.3589 2.5582 1.1652 0.1603 0.1177 0.0548 1.7312 1.2207 0.4233 1.3099 2.7912 4.6848 2.5515 18.1619 0.2264 0.7924 0.0772 11.6591 0.7326 0.6404 2.8364 0.3708 1.1115 0.4180 12.8038 27.4101 16.1657 35.1288 2.6929 0.9760 0.3623 0.0338 0.0926 7.8805 8.7090 4.0755 0.1307 0.0073 3.0489 1.7072 3.6969 7.8694 0.2577 10.3373 13.9182 23.4988 1.5900 0.4970 59.6233 35.6638 63.8016 23.9828 8.4942 16.6691 7.2359 260.0448 126.3332 37.7803 18.3651 40.2847 20.7745 20.3794 39.2354 20.1460 162.6021 143.6549 46.4348 3.1139 16.4545 2.8064 15.2503 81.7234 95.7496 46.1415 31.6302 29.4210 9.9585
temp: 298.150 k
press: 1.00000 atm
elementType: 8 7 6 6 6 6 6 6 6 6 6 6 6 6 6 1 1 1 1 1 1 1 1 1 1 1 1 1 1 1 1 1 1 1 1 1
symmnumber: 1
zpe: 839431.1 jmol-1
zpe.correction: 0.319722 hartree
zpe.thermalcorrener: 0.333036 hartree
zpe.thermalcorrenthalpy: 0.333981 hartree
zpe.thermalcorrgfe: 0.280362 hartree
zpe.sumelectzpe: -636.805127 hartree
zpe.sumelectthermal: -636.791813 hartree
zpe.sumelectthermalent: -636.790869 hartree
zpe.sumelectthermalfe: -636.844487 hartree
dipole: 2.0418 2.4241 2.7626
dipole: 4.2044
quadrupole: -100.8633 -94.3441 -89.5323
quadrupole: -8.0741 -10.9381 -3.1790
quadrupole: -5.9501 0.5691 5.3810 -8.0741 -10.9381 -3.1790
hfenergy: -637.1248491 hartree
pointgroup: C01 [X(C13H21N1O1)]
dipole: -0.8151434 0.8973968 -1.1253476 debye
polarizability: 151.3190472|-5.2399406|132.6129543|0.0067787|-2.3830808|127.0835595 unknown
InChI: InChI=1S/C13H21NO/c1-9(14-8-15)13-5-10-2-11(6-13)4-12(3-10)7-13/h8-12,14H,2-7H2,1H3
charge 0 multiplicity 1
36 atoms
O  3.609269 -1.300484 0.820519
N  2.541588 0.108501 -0.724792
C  0.152577 0.364889 0.082686
C  -1.937161 0.27317 -1.38814
C  -1.41103 -1.665892 0.156509
C  -2.181888 0.541622 1.122101
C  -0.460486 0.752306 -1.297599
C  0.059985 -1.183488 0.246993
C  -0.707376 1.021677 1.207269
C  -1.997521 -1.269404 -1.225586
C  -2.768019 0.942241 -0.25942
C  -2.243498 -1.000056 1.284123
C  1.65103 0.81006 0.233199
C  1.902584 2.331492 0.118152
C  3.448973 -0.863402 -0.354433
H  -2.351986 0.560913 -2.374914
H  -1.440895 -2.767441 0.271177
H  -2.767747 1.026153 1.928394
H  0.125657 0.287582 -2.118512
H  -0.42108 1.850988 -1.442868
H  0.502314 -1.47888 1.219293
H  0.663404 -1.676772 -0.539434
H  -0.683664 2.125844 1.117962
H  -0.280769 0.762711 2.19849
H  -3.04657 -1.617417 -1.311379
H  -1.42233 -1.760376 -2.036849
H  -2.749578 2.045179 -0.375507
H  -3.827202 0.623132 -0.330477
H  -3.296241 -1.344563 1.238925
H  -1.843074 -1.294253 2.274977
H  1.988806 0.469393 1.231812
H  2.970493 2.546355 0.298085
H  1.639673 2.721075 -0.883552
H  1.315356 2.892967 0.863985
H  2.510357 0.393499 -1.706651
H  4.044552 -1.234922 -1.221437
