program: Gaussian 09
title: 000058501
version: EM64L-G09RevD.01
frameworkgroup: C1[X(C26H22N2O)]
method: RPBEPBE
basis: SDD
operation: Freq
keyword: #p
keyword: freq=noraman
keyword: PBEPBE/SDD
title: #p freq=noraman PBEPBE/SDD
converged: YES YES NO NO
title: Mulliken charges:
elementType: O N N C C C C C C C C C C C C C C C C C C C C C C C C C C H H H H H H H H H H H H H H H H H H H H H H
charge: -0.226336 -0.267256 0.000558 -0.505154 0.136252 0.471404 0.505896 -0.576573 0.482602 -0.418462 -0.337005 -0.387891 -0.452885 0.467237 -0.340412 -0.393720 -0.228049 -0.241230 -0.240188 -0.231768 -0.306752 -0.245216 -0.244758 -0.493182 -0.226559 -0.216148 -0.246234 -0.189357 -0.338933 0.235062 0.263066 0.256940 0.237806 0.245469 0.268047 0.227740 0.272805 0.237009 0.227908 0.222766 0.228187 0.223522 0.266729 0.229976 0.225654 0.250831 0.229726 0.228562 0.231798 0.234730 0.245785
chargesum: 0.00000
title: Mulliken charges with hydrogens summed into heavy atoms:
elementType: O N N C C C C C C C C C C C C C C C C C C C C C C C C C C
charge: -0.226336 -0.267256 0.000558 -0.270092 0.136252 0.471404 0.505896 -0.056566 0.482602 -0.180655 -0.091536 -0.119844 -0.225145 0.467237 -0.067606 -0.156711 -0.000141 -0.018465 -0.012001 -0.008246 -0.040023 -0.015240 -0.019103 -0.242351 0.003167 0.012414 -0.014436 0.045373 -0.093149
polarizability: 2.85471934e+02 -2.46579497e+01 2.96073248e+02 1.60665403e+01 1.76090036e+01 2.72892415e+02
1716.lowfreq: -7.1380 -4.3593 -1.2473 -0.0005 0.0004 0.0005 16.3602 21.3302 23.0435
frequency: 16.3019 21.1387 23.0133 29.2554 30.5409 40.3615 49.8975 54.2090 57.1500 81.0203 116.0408 136.4385 169.9954 187.9251 207.9959 222.1567 243.7685 248.0257 280.3973 288.8043 333.1432 378.4625 392.0003 402.7832 404.2825 407.0298 414.9072 451.8683 477.0615 484.0008 506.0003 549.7210 563.1211 596.3311 613.4216 614.4179 616.0658 627.8652 640.1062 672.9079 695.5926 700.0229 705.0194 708.1857 723.3026 745.0698 755.1637 767.9924 783.0127 796.8856 812.0637 837.2020 839.0459 845.0373 859.7531 864.8540 880.6799 910.3929 922.0371 923.4174 934.3959 941.8829 966.7129 968.8038 983.6492 986.6748 988.2834 989.9098 991.2737 991.5014 991.7703 997.3856 1000.3780 1009.7446 1024.9875 1027.6524 1027.9922 1028.6536 1077.4899 1079.7757 1087.3434 1094.6330 1118.0529 1170.8175 1172.1746 1172.9629 1176.0163 1183.8062 1189.2734 1190.3183 1191.6410 1194.1507 1205.8506 1218.4972 1231.5572 1249.8575 1280.7174 1300.3653 1315.1027 1323.8879 1333.4012 1341.1494 1352.1269 1363.5849 1380.2403 1382.0075 1388.8404 1415.6576 1439.5526 1440.1399 1443.8905 1457.6065 1478.5605 1480.5923 1482.1038 1485.3367 1557.9511 1581.1864 1586.4167 1591.6432 1595.1871 1596.1154 1608.3008 1610.5212 1614.4180 3011.4219 3029.0480 3063.9853 3105.2383 3109.5242 3115.4537 3123.3827 3124.9281 3127.2053 3134.2173 3135.1931 3135.9086 3138.9239 3145.4321 3147.8362 3147.9162 3155.3791 3163.1298 3163.8329 3168.8967 3169.2010 3177.9634
redmass: 5.6699 4.9400 5.2226 5.4351 4.2902 3.8950 5.2575 4.0281 4.7748 5.8394 5.5909 5.7327 4.6913 5.2425 4.8121 5.2419 4.3983 5.0122 4.5159 3.7837 7.3630 2.5749 3.0663 2.7909 2.8509 2.9269 5.5940 4.0051 3.6730 4.1206 3.6322 5.3289 5.7104 5.7462 6.3254 6.3735 6.3926 5.9974 5.5794 4.9147 2.4568 1.6964 3.3006 1.8190 2.0641 2.9049 1.8631 1.8707 2.8224 2.6898 2.3895 1.5212 2.6718 1.2828 1.2538 3.6710 2.5722 1.3999 1.4732 1.5377 1.4613 1.5453 1.3779 1.3958 1.5418 2.4209 1.8262 3.7058 2.0661 2.0029 1.9953 2.0440 1.4089 2.8562 2.4519 2.7622 2.4246 2.2034 2.0975 1.6529 1.6036 2.1746 1.7453 1.0868 1.1839 1.0543 1.6877 1.8835 1.4624 1.1646 1.4814 1.1211 2.2570 1.8316 2.5242 1.5812 1.6801 2.5590 2.0345 1.4341 1.2864 1.3441 1.4261 1.6078 7.5629 8.4870 5.2440 2.0026 2.3076 2.2066 2.0628 2.0003 1.5512 2.1228 2.1204 1.5769 5.4998 7.8212 5.6195 6.0236 5.9677 6.7321 5.9772 6.2416 6.4039 1.0609 1.0820 1.1009 1.0909 1.0878 1.0875 1.0866 1.0865 1.0853 1.0881 1.0914 1.0884 1.0924 1.0959 1.0929 1.0928 1.0970 1.1014 1.0981 1.1001 1.0983 1.0980
irintensity: 0.0500 0.9569 0.6790 1.5014 0.3501 0.1057 0.5570 0.4824 0.0776 1.6221 1.4166 6.1273 0.3763 2.3888 2.9275 1.5848 0.5770 0.7128 0.2021 0.6313 9.0537 8.9896 2.0325 0.3526 0.1311 0.7292 0.6072 1.0719 3.0272 3.1975 6.7227 8.6404 5.0094 28.9993 1.0763 0.1918 1.0270 15.6327 10.7598 3.1861 14.3031 44.8767 41.6879 74.0398 44.8196 18.1790 36.9450 31.6534 6.1561 19.8215 19.7700 1.5875 0.5388 0.0977 0.1370 8.0797 10.0961 0.9879 1.8440 0.4117 0.9734 0.6933 0.5715 0.3276 4.2896 8.0183 5.4298 0.6415 0.3307 0.0361 0.1452 8.4651 1.4960 33.1343 4.8331 7.5393 2.2023 11.5679 13.6308 2.8103 18.3806 36.3591 1.2454 1.6828 16.9312 0.7176 57.6871 19.5714 19.3131 0.7281 46.7024 1.7516 17.5413 2.3605 47.9918 2.5490 0.1325 36.8249 14.8199 11.2485 4.6330 18.0601 72.9773 87.7591 1.0545 1.1123 4.0519 19.8763 6.2796 13.2864 11.5406 25.9896 57.4240 44.0619 8.5155 28.8209 15.1670 117.4252 0.6266 2.0592 0.2021 42.9981 13.1715 38.4550 23.6755 9.3277 5.9583 3.4049 26.6831 10.4376 5.7050 0.3947 0.9931 6.0782 5.5276 8.2149 4.5496 29.6137 25.8121 20.5124 19.4142 42.3444 30.1185 28.8360 19.8177 8.1462 2.6843
temp: 298.150 k
press: 1.00000 atm
elementType: 8 7 7 6 6 6 6 6 6 6 6 6 6 6 6 6 6 6 6 6 6 6 6 6 6 6 6 6 6 1 1 1 1 1 1 1 1 1 1 1 1 1 1 1 1 1 1 1 1 1 1
symmnumber: 1
zpe: 1068272.1 jmol-1
zpe.correction: 0.406883 hartree
zpe.thermalcorrener: 0.431200 hartree
zpe.thermalcorrenthalpy: 0.432144 hartree
zpe.thermalcorrgfe: 0.348144 hartree
zpe.sumelectzpe: -1186.686561 hartree
zpe.sumelectthermal: -1186.662244 hartree
zpe.sumelectthermalent: -1186.661300 hartree
zpe.sumelectthermalfe: -1186.745301 hartree
dipole: 2.2817 -0.0327 -1.1464
dipole: 2.5537
quadrupole: -156.5191 -163.3872 -166.4112
quadrupole: 0.9289 2.4638 16.5694
quadrupole: 5.5868 -1.2814 -4.3054 0.9289 2.4638 16.5694
hfenergy: -1187.0934447 hartree
pointgroup: C01 [X(C26H22N2O1)]
dipole: 0.9193645 -0.2406973 0.3259747 debye
polarizability: 265.1868653|22.1664005|277.9757497|15.5571574|-3.3807954|311.2749821 unknown
InChI: InChI=1S/C26H22N2O/c29-26(25(22-12-4-1-5-13-22)23-14-6-2-7-15-23)28(24-16-8-3-9-17-24)20-21-11-10-18-27-19-21/h1-19,25H,20H2
charge 0 multiplicity 1
51 atoms
O  -0.568112 1.851242 0.997765
N  1.114332 0.250087 0.743852
N  1.914226 -2.455657 -3.307445
C  -1.156812 -0.183209 -0.258961
C  -0.190299 0.739256 0.529127
C  -1.80061 -1.211255 0.691045
C  -2.191109 0.635501 -1.041982
C  1.547823 -1.087622 0.258171
C  2.06615 1.044839 1.500104
C  -2.175442 -2.481109 0.179997
C  -3.229562 1.34689 -0.391678
C  -2.061711 -0.91826 2.05394
C  -2.105564 0.685507 -2.455521
C  1.884321 -1.137765 -1.231111
C  2.272858 2.410257 1.180246
C  2.801698 0.455235 2.557899
C  -2.798351 -3.438463 1.010133
C  -4.162984 2.092396 -1.143522
C  -2.683375 -1.876969 2.885834
C  -3.040513 1.429992 -3.210678
C  2.504644 -0.055272 -1.902334
C  -3.054478 -3.139018 2.368836
C  -4.073716 2.136555 -2.55501
C  1.611519 -2.30793 -1.98399
C  3.216133 3.167888 1.90574
C  3.752205 1.217198 3.272806
C  3.965266 2.576171 2.949608
C  2.825852 -0.187727 -3.270392
C  2.516586 -1.399975 -3.930952
H  -0.575621 -0.745042 -1.010906
H  0.784193 -1.848905 0.499659
H  2.452729 -1.361386 0.827579
H  -1.993144 -2.712288 -0.877313
H  -3.302036 1.32442 0.699553
H  -1.778096 0.058456 2.463266
H  -1.303894 0.139396 -2.969848
H  1.680615 2.876125 0.388439
H  2.615714 -0.585784 2.845492
H  -3.084742 -4.413112 0.599082
H  -4.960415 2.64056 -0.629049
H  -2.879333 -1.636847 3.93703
H  -2.962749 1.456533 -4.303529
H  2.725745 0.872161 -1.363709
H  -3.537451 -3.880345 3.015148
H  -4.801601 2.714141 -3.136145
H  1.124896 -3.171315 -1.510404
H  3.365831 4.223465 1.653757
H  4.313694 0.750743 4.089727
H  4.69846 3.168213 3.507782
H  3.304941 0.629399 -3.818909
H  2.749189 -1.540471 -4.992532
