program: Gaussian 09
title: 000058349
version: EM64L-G09RevD.01
frameworkgroup: C1[X(C8H18Cl2N2O2)]
method: RPBEPBE
basis: SDD
operation: Freq
keyword: #p
keyword: freq=noraman
keyword: PBEPBE/SDD
title: #p freq=noraman PBEPBE/SDD
converged: YES YES NO NO
title: Mulliken charges:
elementType: Cl Cl O O N N C C C C C C C C H H H H H H H H H H H H H H H H H H
charge: -0.066462 -0.075965 -0.448753 -0.447920 0.017305 0.020480 -0.401413 -0.353260 -0.274670 -0.295044 -0.572043 -0.609603 -0.601428 -0.587338 0.320446 0.226212 0.274525 0.224036 0.229935 0.262080 0.262339 0.235842 0.280729 0.215201 0.240681 0.204467 0.251980 0.313819 0.262786 0.314952 0.316854 0.259230
chargesum: 0.00000
title: Mulliken charges with hydrogens summed into heavy atoms:
elementType: Cl Cl O O N N C C C C C C C C
charge: -0.066462 -0.075965 -0.448753 -0.447920 0.017305 0.020480 0.145245 0.145301 0.217346 0.203137 0.164567 0.160662 -0.023689 -0.011254
polarizability: 1.74882889e+02 1.12870708e-01 1.23920029e+02 4.10014569e+00 -1.57136567e-02 1.09560872e+02
1716.lowfreq: -9.5291 -6.1897 -0.0020 -0.0013 0.0005 8.1608 16.0237 35.5910 44.5238
frequency: 15.7672 35.5135 44.4964 57.1705 77.8505 105.3830 134.5343 148.4589 182.4967 211.4633 229.6026 252.7844 262.2487 287.2398 289.5777 307.9041 352.8338 366.9858 376.1828 405.7168 453.3291 461.7320 486.2901 526.2460 570.0086 618.3738 651.3509 683.2911 742.6954 799.4817 806.0560 812.5715 827.9285 847.3932 880.8140 914.4602 929.7253 979.8375 997.3291 1020.2186 1038.9346 1079.2547 1086.9409 1094.1081 1118.3721 1135.2275 1149.5967 1174.6013 1183.2119 1196.9771 1231.8786 1235.8097 1246.6950 1255.7809 1277.1215 1280.6610 1310.9568 1348.3966 1357.6394 1368.9374 1395.9062 1411.5116 1421.9833 1442.8370 1452.0573 1455.6590 1461.1601 1461.8878 1467.0909 1468.4610 1475.6639 1484.2748 2880.4367 2973.6608 3003.3458 3015.7403 3019.5306 3023.6940 3054.9844 3079.4967 3087.6058 3088.5721 3100.2450 3102.3718 3111.9233 3122.9172 3141.4468 3156.3605 3191.2384 3195.8389
redmass: 8.0582 5.1476 5.8635 3.0198 3.4130 2.5091 3.2727 4.8080 4.0910 2.9921 1.5324 4.1292 2.3915 2.1454 1.6452 3.0800 2.3515 3.0547 2.7463 2.6087 3.2012 3.2394 3.7800 4.1303 4.1501 3.9468 5.6762 4.3440 3.4226 1.3239 2.2113 1.6973 2.7528 4.9821 2.8714 2.9209 2.3296 2.0558 1.2785 1.3621 1.9886 3.0955 2.9082 2.9101 1.3218 1.3962 1.5666 1.6358 1.6044 1.5363 1.4068 1.2108 1.2203 1.2476 1.1578 1.1519 1.2239 1.3017 1.3199 1.3641 1.1027 1.1623 1.1386 1.0586 1.0505 1.0812 1.0893 1.0749 1.0859 1.0809 1.0662 1.0567 1.0705 1.0333 1.0365 1.0614 1.0595 1.0592 1.0918 1.1039 1.0664 1.0651 1.0971 1.0984 1.1045 1.0981 1.1027 1.1041 1.1090 1.1078
irintensity: 2.2783 2.2811 4.1883 2.8069 3.8671 2.6329 8.4582 3.7833 16.9023 0.3351 5.3996 10.4127 5.4665 0.7321 7.8943 18.1440 21.5242 29.3672 23.0619 16.4007 35.7374 10.9348 53.2868 10.7656 16.5472 15.4366 55.7093 37.4402 10.8176 3.9671 7.3116 16.5726 4.3794 15.8863 8.4879 14.7030 5.3760 2.2497 1.6788 0.4874 4.5416 0.8970 2.5602 2.0044 3.2098 53.3287 7.1377 4.7252 5.5437 6.4530 26.0543 11.0418 7.7345 7.3280 1.0344 1.1855 4.0041 6.8759 4.1427 2.2444 17.3709 8.4705 21.4637 15.3215 22.4203 2.4525 3.7326 1.5833 3.2218 34.2513 31.7468 19.9551 134.3117 73.3642 19.8280 12.0578 11.1411 26.1300 17.3908 44.2311 4.7004 8.2375 15.2383 8.7233 7.1241 14.0497 3.4739 8.9662 5.4726 5.1969
temp: 298.150 k
press: 1.00000 atm
elementType: 17 17 8 8 7 7 6 6 6 6 6 6 6 6 1 1 1 1 1 1 1 1 1 1 1 1 1 1 1 1 1 1
symmnumber: 1
zpe: 694266.8 jmol-1
zpe.correction: 0.264432 hartree
zpe.thermalcorrener: 0.281430 hartree
zpe.thermalcorrenthalpy: 0.282374 hartree
zpe.thermalcorrgfe: 0.217395 hartree
zpe.sumelectzpe: -1494.389182 hartree
zpe.sumelectthermal: -1494.372184 hartree
zpe.sumelectthermalent: -1494.371240 hartree
zpe.sumelectthermalfe: -1494.436219 hartree
dipole: -1.8981 -0.1313 -1.1148
dipole: 2.2052
quadrupole: -124.0944 -107.4512 -96.9158
quadrupole: -6.3306 12.6706 -0.0663
quadrupole: -14.6072 2.0359 12.5713 -6.3306 12.6706 -0.0663
hfenergy: -1494.6536143 hartree
pointgroup: C01 [X(C8H18Cl2N2O2)]
dipole: -0.7931825 -0.1046372 -0.3356042 debye
polarizability: 174.920534|0.0567074|123.6506394|-3.7776591|-1.9737227|109.7926173 unknown
InChI: InChI=1S/C8H18Cl2N2O2/c1-11(13,5-3-9)7-8-12(2,14)6-4-10/h3-8H2,1-2H3
charge 0 multiplicity 1
32 atoms
Cl -4.911769 -1.766991 1.093473
Cl 5.126724 -1.69264 -0.485331
O  -1.496728 1.189992 1.094576
O  1.911514 1.43307 -1.062718
N  -1.761362 0.648629 -0.211155
N  1.773087 0.694529 0.160696
C  -0.457457 0.172251 -0.912261
C  0.571612 -0.348945 0.074337
C  -2.715203 -0.550726 -0.050967
C  3.075762 -0.070332 0.407198
C  -2.388163 1.726004 -1.08266
C  1.51696 1.662068 1.310369
C  -3.802713 -0.235622 0.977833
C  3.617917 -0.623632 -0.91404
H  0.041435 1.041252 -1.40557
H  -0.736148 -0.572341 -1.678259
H  0.144106 -0.443853 1.087715
H  1.016085 -1.296535 -0.266979
H  -3.143944 -0.810679 -1.036153
H  -2.102216 -1.392585 0.310499
H  3.795866 0.649945 0.827544
H  2.893795 -0.873426 1.145412
H  -1.697376 2.580138 -1.069804
H  -2.537923 1.360621 -2.114554
H  -3.344066 2.024972 -0.629303
H  1.656873 1.150477 2.280601
H  2.23513 2.484597 1.183158
H  0.470021 2.000472 1.226499
H  -4.469469 0.587581 0.687594
H  -3.373854 -0.064586 1.9708
H  3.96564 0.174992 -1.576498
H  2.921566 -1.291196 -1.439452
