program: Gaussian 09
title: 000058351
version: EM64L-G09RevD.01
frameworkgroup: C1[X(C14H22Cl2N2)]
method: RPBEPBE
basis: SDD
operation: Freq
keyword: #p
keyword: freq=noraman
keyword: PBEPBE/SDD
title: #p freq=noraman PBEPBE/SDD
converged: YES YES NO NO
title: Mulliken charges:
elementType: Cl Cl N N C C C C C C C C C C C C C C H H H H H H H H H H H H H H H H H H H H H H
charge: -0.073299 -0.073978 -0.099065 -0.148944 -0.408354 -0.442752 -0.333849 -0.336615 -0.394309 0.445708 -0.571853 -0.565978 -0.663994 -0.373024 -0.350284 -0.236789 -0.239516 -0.271730 0.218668 0.250276 0.228769 0.228448 0.233097 0.237678 0.234606 0.235121 0.224031 0.213389 0.268841 0.263215 0.264994 0.260898 0.217161 0.242250 0.214660 0.225580 0.212724 0.218578 0.219325 0.226315
chargesum: 0.00000
title: Mulliken charges with hydrogens summed into heavy atoms:
elementType: Cl Cl N N C C C C C C C C C C C C C C
charge: -0.073299 -0.073978 -0.099065 -0.148944 0.060590 0.014465 0.136926 0.133112 0.043112 0.445708 -0.039797 -0.040085 0.010077 -0.147444 -0.137560 -0.018211 -0.020191 -0.045415
polarizability: 2.34524443e+02 -1.98135144e+01 2.11513577e+02 1.12397016e+01 -1.26294005e+01 1.26133007e+02
1716.lowfreq: -4.7833 -1.9910 -0.0009 0.0009 0.0020 8.5309 12.3107 19.0716 25.6226
frequency: 10.6339 18.9996 25.5371 29.1623 46.2636 62.6245 68.5369 83.0887 91.0305 104.3585 137.2331 172.9776 195.3287 196.8997 205.6572 238.4577 271.8909 289.6205 294.1367 360.0517 383.1307 390.3611 420.4592 451.1518 467.5263 506.6803 528.4755 573.4304 615.1126 657.2424 658.5325 691.2414 728.7126 751.8743 768.2135 775.9998 779.7173 790.5768 806.0780 840.1557 862.7180 897.7944 952.6706 973.4069 974.3096 992.0737 996.8470 998.7951 1027.1270 1031.5599 1041.7878 1059.5721 1065.1308 1079.1781 1093.2167 1102.1119 1109.8919 1137.0290 1171.8344 1176.5711 1202.4456 1216.7734 1236.7670 1243.6856 1254.2818 1258.8178 1279.0068 1288.0323 1306.3776 1321.2268 1330.0104 1335.9090 1347.5041 1359.7767 1366.3013 1377.2408 1380.9055 1387.2782 1389.1310 1448.1718 1449.7159 1451.2036 1466.2051 1466.7634 1471.2460 1471.6689 1478.8684 1487.7471 1494.7774 1507.2411 1576.6519 1620.9357 2936.0703 2953.8637 2959.3207 2982.4015 2983.1500 2989.4496 3024.4368 3035.1346 3039.9760 3048.5633 3050.6958 3055.1353 3055.9898 3078.4876 3093.1540 3121.2768 3127.0491 3142.4216 3144.3512 3150.4141 3156.6699 3169.3873
redmass: 5.6103 7.7347 4.8392 7.8142 3.8491 3.9890 3.5749 2.4519 2.6101 2.9459 2.5903 2.7657 4.6690 5.3359 1.2330 3.4000 3.8121 2.6469 4.0139 4.3984 3.4151 2.8569 2.9151 2.6788 3.2011 2.7113 2.9505 3.7094 6.3647 6.3901 5.8805 1.7820 4.1251 1.9074 1.1170 1.1458 1.1827 1.1858 1.2554 4.3334 1.4937 2.3435 1.3671 1.4938 3.3338 2.2226 2.1520 1.6241 2.7730 2.2855 2.4745 3.6296 2.4055 2.0060 1.6740 1.6192 1.7142 1.4066 1.1481 1.5602 1.1177 2.2875 1.3341 1.2099 1.4417 1.5462 1.2322 1.2069 1.1975 1.3658 1.3618 1.4128 1.3465 1.3429 1.3204 1.4707 4.0026 1.5830 1.4106 1.1591 2.0941 1.0926 1.0520 1.1003 1.0965 1.0826 1.0610 1.0800 1.6100 1.4906 5.9987 6.0850 1.0658 1.0655 1.0647 1.0598 1.0366 1.0604 1.0949 1.1019 1.0986 1.0946 1.0978 1.0623 1.0591 1.0996 1.1006 1.0844 1.0883 1.1122 1.1125 1.0915 1.0936 1.1001
irintensity: 0.5603 0.1180 0.6336 0.6995 0.3127 0.4721 0.4436 2.7368 1.3384 0.5163 0.2755 0.7748 5.7726 6.8850 0.3990 1.2427 0.6790 0.8214 0.8747 9.6947 13.1441 10.8876 0.4304 1.4134 4.8333 13.5611 0.0878 1.2967 0.2983 66.3619 139.6322 39.1426 1.9478 81.8861 3.1799 13.1582 6.2255 15.4653 0.7213 5.4820 4.9796 2.2828 0.0656 0.3908 2.8686 5.3961 23.0158 0.7314 4.1135 11.7377 12.7860 0.3867 33.1846 1.5738 0.4287 47.1898 66.0714 7.5136 6.5437 45.0102 11.7238 54.7781 26.3002 22.2322 15.7994 15.5680 16.1073 9.8148 9.9446 19.7256 6.5631 8.2297 48.6986 5.8244 3.2724 7.6515 9.1640 34.0829 35.9996 4.1919 2.8442 7.1873 4.7158 7.0705 18.5477 5.9831 2.1324 22.7979 89.9764 95.8538 10.9255 191.6447 41.8864 32.3231 49.0871 67.7836 24.2221 40.6958 1.9350 16.7455 6.6889 18.3013 46.4152 17.3732 36.8786 44.8857 40.4109 11.0657 6.7687 13.4783 30.3481 44.4967 42.7434 6.4276
temp: 298.150 k
press: 1.00000 atm
elementType: 17 17 7 7 6 6 6 6 6 6 6 6 6 6 6 6 6 6 1 1 1 1 1 1 1 1 1 1 1 1 1 1 1 1 1 1 1 1 1 1
symmnumber: 1
zpe: 884045.4 jmol-1
zpe.correction: 0.336715 hartree
zpe.thermalcorrener: 0.357157 hartree
zpe.thermalcorrenthalpy: 0.358101 hartree
zpe.thermalcorrgfe: 0.282070 hartree
zpe.sumelectzpe: -1574.881535 hartree
zpe.sumelectthermal: -1574.861093 hartree
zpe.sumelectthermalent: -1574.860148 hartree
zpe.sumelectthermalfe: -1574.936180 hartree
dipole: -1.0454 -2.2437 0.3424
dipole: 2.4988
quadrupole: -140.1801 -133.4866 -126.1913
quadrupole: 6.9373 0.3436 -7.4410
quadrupole: -6.8941 -0.2006 7.0947 6.9373 0.3436 -7.4410
hfenergy: -1575.2182498 hartree
pointgroup: C01 [X(C14H22Cl2N2)]
dipole: -0.533241 -0.8196489 0.1017092 debye
polarizability: 228.1481223|-22.209782|218.1406236|10.986574|-12.1419644|125.8822813 unknown
InChI: InChI=1S/C14H22Cl2N2/c1-2-18(14-6-4-3-5-7-14)13-12-17(10-8-15)11-9-16/h3-7H,2,8-13H2,1H3
charge 0 multiplicity 1
40 atoms
Cl 3.52419 3.613917 1.165711
Cl 5.047028 -3.19538 -0.441963
N  2.321625 -0.063095 -0.351611
N  -1.349456 -0.824713 0.418997
C  0.92876 -0.477313 -0.607476
C  0.038893 -0.410969 0.667672
C  2.59566 1.382017 -0.280554
C  3.397998 -0.943293 -0.835703
C  -1.688871 -2.229514 0.718375
C  -2.329113 0.095664 -0.0009
C  3.173152 1.749368 1.096504
C  3.70927 -2.020831 0.216824
C  -2.227323 -2.450209 2.152649
C  -3.706544 -0.279237 -0.108813
C  -1.98777 1.443523 -0.343475
C  -4.677988 0.644617 -0.543565
C  -2.973057 2.357999 -0.766059
C  -4.328911 1.973639 -0.875789
H  0.932787 -1.520771 -0.975206
H  0.460964 0.139616 -1.406451
H  0.485021 -1.072386 1.434438
H  0.064143 0.611919 1.089702
H  1.656615 1.94466 -0.438854
H  3.302128 1.708162 -1.072339
H  4.310398 -0.346819 -1.01937
H  3.133145 -1.434789 -1.795903
H  -2.419635 -2.599068 -0.025176
H  -0.77527 -2.83767 0.57478
H  2.46376 1.54189 1.911005
H  4.14123 1.26283 1.290399
H  4.111906 -1.589529 1.145124
H  2.839629 -2.660351 0.432188
H  -1.478296 -2.141231 2.904299
H  -3.143346 -1.859912 2.327427
H  -2.462791 -3.517752 2.320828
H  -4.029353 -1.289968 0.156927
H  -0.949429 1.78543 -0.291911
H  -5.722916 0.319711 -0.613512
H  -2.672046 3.381578 -1.0190
H  -5.089185 2.687359 -1.20852
