program: Gaussian 09
title: 000058271
version: EM64L-G09RevD.01
frameworkgroup: C1[X(C13H20N2)]
method: RPBEPBE
basis: SDD
operation: Freq
keyword: #pfreq=noraman
keyword: PBEPBE/SDD
title: #p freq=noraman PBEPBE/SDD
converged: YES YES NO NO
title: Mulliken charges:
elementType: N N C C C C C C C C C C C C C H H H H H H H H H H H H H H H H H H H H
charge: -0.129977 -0.081417 -0.244137 0.608080 -0.560214 -0.697904 -0.694203 -0.507977 0.074236 0.332819 -0.396793 -0.807388 -0.156108 -0.629583 -0.590743 0.206260 0.232246 0.205976 0.208450 0.227248 0.228447 0.207012 0.209411 0.228064 0.224634 0.239627 0.209052 0.227127 0.218612 0.220619 0.288284 0.219782 0.227798 0.224591 0.228071
chargesum: 0.00000
title: Mulliken charges with hydrogens summed into heavy atoms:
elementType: N N C C C C C C C C C C C C C
charge: -0.129977 -0.081417 -0.037877 0.608080 -0.327968 -0.056229 -0.049334 -0.279913 0.074236 0.332819 -0.172159 -0.131583 0.062504 0.099101 0.089716
polarizability: 2.33259391e+02 1.47564778e+01 1.74653565e+02 -3.70720978e+00 -3.07012572e-01 1.02489593e+02
1716.lowfreq: -6.8262 -4.9162 -0.0005 -0.0002 0.0000 6.5947 23.7023 40.8967 61.8205
frequency: 23.5707 40.6057 61.8078 72.7403 90.8723 95.4640 117.9675 130.0196 168.5303 180.4377 210.5307 213.0813 233.9985 253.9986 260.0659 292.6440 307.4629 347.5002 379.6160 394.3029 432.6252 457.9325 471.7710 511.3448 532.9718 638.9617 651.8356 701.8684 737.0864 770.9615 822.8796 859.5482 876.5429 888.3036 916.0220 931.1771 941.5869 951.6245 953.0381 994.4032 1044.9562 1058.5841 1065.3290 1083.3226 1095.8210 1114.1195 1131.2977 1136.3323 1143.4376 1179.9178 1211.9885 1237.9511 1244.1233 1270.2342 1310.2110 1320.9854 1367.9095 1369.8456 1374.1579 1391.5582 1392.5932 1395.6738 1414.3686 1421.6362 1441.2348 1453.4828 1457.7985 1466.6745 1467.1687 1473.3204 1473.5169 1478.1455 1483.8271 1485.8689 1498.6769 1510.0195 1576.9109 1607.3322 1645.5465 2949.5403 2958.4712 2970.4288 2973.7046 2976.0540 2978.4446 2980.5677 3019.4157 3031.6751 3054.4685 3062.0748 3069.7502 3074.9086 3079.8738 3081.9790 3084.4270 3108.1928 3108.8538 3110.9877 3133.3504
redmass: 2.6150 2.5926 3.1058 3.1100 1.5490 2.3665 1.1421 1.0740 2.8331 3.0080 1.6848 1.2006 1.7266 1.7036 2.5694 2.9331 3.6996 2.7795 3.4643 2.6543 3.0709 3.4960 3.0660 3.9732 2.9367 6.5763 4.2712 3.6383 2.5445 4.9454 1.3478 2.9921 2.3916 2.1321 1.1880 2.1818 1.3815 1.6277 1.4536 1.5990 1.5411 1.3600 1.6494 1.9069 1.2232 2.5579 1.6891 1.9882 1.3694 1.8378 1.8904 2.9770 2.9990 1.4745 1.3237 1.9716 4.4302 1.5151 1.1980 2.2783 1.2368 1.3117 1.1499 2.2756 1.2299 1.0572 1.0445 1.0469 1.0494 1.0990 1.1212 1.0547 1.1292 1.0517 1.7816 1.5847 6.3645 6.3242 6.0403 1.0364 1.0369 1.0348 1.0355 1.0365 1.0837 1.0862 1.1002 1.1009 1.0963 1.0999 1.0991 1.1003 1.0995 1.1002 1.0976 1.0867 1.0974 1.0895 1.0965
irintensity: 0.1824 0.4517 1.4698 3.0830 0.1295 0.7008 0.4132 0.1147 0.3645 1.5237 0.8849 0.2045 0.6621 0.8092 0.6239 0.1881 9.1597 17.2674 0.4243 1.6412 2.3136 3.7521 4.0035 4.1757 0.7435 1.1017 11.7658 0.7858 2.8641 0.5318 27.4496 11.9541 9.2665 15.8827 2.4447 34.0754 0.4546 10.1860 0.6737 24.3575 8.0568 4.2948 50.2975 206.1994 3.0330 1.7346 5.3318 7.4624 1.8399 3.6768 1.8306 3.9021 29.7654 6.3343 0.8707 17.1689 11.5640 45.7287 15.9598 38.3685 13.7716 15.6489 24.9689 1.2406 23.9147 16.0811 7.9709 4.6442 0.5577 16.4100 32.5362 4.6964 2.4675 16.3455 44.1555 35.5045 104.6308 113.9653 726.4460 92.6681 155.3581 31.6785 44.2612 37.0637 19.0171 48.1904 50.5849 33.3816 21.6848 0.8989 120.6380 27.0691 36.9919 27.5743 26.5490 13.9661 1.6662 25.3643 32.5338
temp: 298.150 k
press: 1.00000 atm
elementType: 7 7 6 6 6 6 6 6 6 6 6 6 6 6 6 1 1 1 1 1 1 1 1 1 1 1 1 1 1 1 1 1 1 1 1
symmnumber: 1
zpe: 789659.4 jmol-1
zpe.correction: 0.300765 hartree
zpe.thermalcorrener: 0.318172 hartree
zpe.thermalcorrenthalpy: 0.319116 hartree
zpe.thermalcorrgfe: 0.254649 hartree
zpe.sumelectzpe: -615.731994 hartree
zpe.sumelectthermal: -615.714587 hartree
zpe.sumelectthermalent: -615.713643 hartree
zpe.sumelectthermalfe: -615.778110 hartree
dipole: -2.7744 -2.4998 -0.7902
dipole: 3.8172
quadrupole: -74.5575 -86.7682 -94.9194
quadrupole: 6.0933 0.7870 0.7637
quadrupole: 10.8575 -1.3532 -9.5043 6.0933 0.7870 0.7637
hfenergy: -616.032759 hartree
pointgroup: C01 [X(C13H20N2)]
dipole: 1.0818025 -0.9464195 0.4351494 debye
polarizability: 232.6967409|-16.209807|173.7697198|-3.2789961|-9.6874146|103.9360875 unknown
InChI: InChI=1S/C13H20N2/c1-10(2)12-7-6-11(3)13(8-12)14-9-15(4)5/h6-10H,1-5H3
charge 0 multiplicity 1
35 atoms
N  1.599319 0.41374 -0.276849
N  3.451605 -1.001862 0.137792
C  -3.212523 -1.080753 0.191419
C  -2.150988 0.019462 0.091517
C  -0.775385 -0.296986 -0.021542
C  -3.020891 -1.956168 1.458759
C  -3.246335 -1.963272 -1.084988
C  -2.524303 1.384646 0.086304
C  0.221623 0.713467 -0.125818
C  -0.168827 2.092703 -0.147555
C  -1.542991 2.397107 -0.036899
C  0.878542 3.180268 -0.276882
C  2.154166 -0.583244 0.369793
C  4.2761 -0.361101 -0.894278
C  4.086108 -2.022207 0.975768
H  -4.198547 -0.580385 0.278185
H  -0.462406 -1.348323 -0.069803
H  -2.059156 -2.501824 1.421706
H  -3.830705 -2.705374 1.543126
H  -3.022529 -1.336751 2.3738
H  -3.419615 -1.350113 -1.98756
H  -4.050881 -2.719763 -1.016765
H  -2.287995 -2.498532 -1.220912
H  -3.584255 1.656577 0.164722
H  -1.852179 3.449817 -0.04881
H  1.510656 3.010601 -1.167568
H  0.408973 4.176769 -0.353787
H  1.564767 3.185329 0.590869
H  1.641611 -1.158794 1.165663
H  5.137376 0.169879 -0.441639
H  3.645645 0.366243 -1.428579
H  4.663467 -1.115212 -1.606693
H  4.483459 -2.849677 0.355581
H  3.350548 -2.44237 1.682801
H  4.927245 -1.598398 1.561621
