program: Gaussian 09
title: 000058242
version: EM64L-G09RevD.01
frameworkgroup: C1[X(C13H18N2O3)]
method: RPBEPBE
basis: SDD
operation: Freq
keyword: #p
keyword: freq=noraman
keyword: PBEPBE/SDD
title: #p freq=noraman PBEPBE/SDD
converged: YES YES NO NO
title: Mulliken charges:
elementType: O O O N N C C C C C C C C C C C C C H H H H H H H H H H H H H H H H H H
charge: -0.326794 -0.292053 -0.268583 -0.246232 -0.121723 -0.510098 0.426755 0.284332 0.270758 -0.347608 -0.367408 -0.632532 -0.663953 -0.220117 -0.230495 -0.246972 -0.205161 -0.683525 0.258032 0.262618 0.262193 0.303964 0.225778 0.228262 0.286500 0.281554 0.232772 0.236356 0.224507 0.225733 0.226551 0.235136 0.227918 0.219547 0.217228 0.226759
chargesum: 0.00000
title: Mulliken charges with hydrogens summed into heavy atoms:
elementType: O O O N N C C C C C C C C C C C C C
charge: -0.326794 -0.292053 -0.268583 -0.246232 -0.121723 0.010552 0.426755 0.284332 0.270758 -0.085415 -0.063444 0.108009 0.086730 0.004390 -0.004762 -0.020422 0.257893 -0.019991
polarizability: 2.28305783e+02 5.88951932e+00 1.63062304e+02 5.44535128e+00 6.60100323e+00 1.05521453e+02
1716.lowfreq: -8.3193 -6.1221 -0.0002 0.0003 0.0008 6.8991 19.0771 30.0663 44.0896
frequency: 18.7754 29.5830 44.0636 50.3072 70.2674 78.9776 93.3331 99.4567 134.3674 146.7376 158.1782 172.0587 210.6604 241.8790 254.5270 258.0410 273.9750 322.4094 350.1953 382.2847 403.9975 408.3641 419.9893 446.0885 512.3692 540.4027 594.4708 613.9252 617.2662 672.4777 696.1890 702.7104 757.8676 767.7937 799.0940 809.7711 816.3929 845.3051 917.5993 924.1676 943.9240 974.5052 986.0400 994.0683 996.8071 1028.6062 1040.1277 1056.8769 1084.0955 1092.7224 1107.7294 1109.7820 1136.4485 1138.1899 1148.2065 1172.4641 1193.8894 1210.2510 1237.6745 1244.7191 1250.2035 1326.3104 1339.7457 1345.7196 1377.3154 1383.8868 1395.3290 1397.5171 1415.5940 1436.3605 1443.7596 1456.1348 1464.8696 1473.8886 1475.7780 1486.0556 1486.3394 1490.1201 1494.7173 1505.2679 1591.5822 1595.5516 1608.9187 1646.8229 2969.9131 2975.6252 2990.3747 3013.0160 3033.0113 3050.1542 3066.0656 3068.9586 3087.7610 3099.9569 3101.3456 3105.9081 3120.9574 3124.6026 3133.3467 3144.1185 3160.5033 3181.7138
redmass: 2.6430 2.8439 3.4468 3.4997 3.6986 2.8132 4.5355 4.7884 3.3001 1.5476 1.6880 1.9441 3.6775 4.1527 2.9627 1.2884 3.9265 5.7118 3.1718 3.6334 3.2881 3.2241 3.1294 3.1144 3.4855 4.4446 6.0180 6.0387 4.7230 5.2749 4.4628 2.5693 5.0895 1.9100 1.0990 5.9723 3.7983 1.2584 2.5071 1.5760 3.3658 1.4130 2.6119 2.4699 1.7672 2.2575 2.9018 1.4438 1.7789 1.2284 3.0821 2.4317 1.3919 1.4621 2.0042 1.0516 1.1260 1.9413 3.1417 4.9673 1.1299 1.3550 1.7049 1.3744 2.0404 4.9467 1.5543 1.7871 1.2076 1.2058 2.2316 1.0940 1.0423 1.0588 1.0763 1.1053 2.1569 1.1139 1.0878 1.0734 6.5387 6.1410 6.0023 11.1402 1.0368 1.0385 1.0355 1.0583 1.0621 1.1020 1.0947 1.1055 1.0984 1.1020 1.1036 1.0991 1.0975 1.0854 1.0897 1.0945 1.0990 1.0963
irintensity: 0.5507 2.9344 0.6238 1.1673 5.7133 1.8011 1.6048 0.9942 1.4178 0.3812 1.1331 2.2984 0.4607 3.7169 6.4911 1.6600 1.3347 11.3576 6.4433 8.4286 8.8291 1.7799 2.0062 3.1215 8.5801 7.9254 23.8634 1.1453 7.6487 6.7602 8.5762 51.0261 23.9284 47.6113 3.2702 10.9745 1.3129 1.2321 20.6870 4.1915 21.7503 0.1286 0.4987 31.9376 18.8803 23.9648 144.0431 16.2468 46.1548 3.5523 172.6357 46.1174 2.9313 3.9511 108.7272 0.2094 1.2018 262.8700 12.7024 16.4253 0.1699 24.7766 24.0245 59.4587 73.7721 22.9689 58.1121 24.7275 39.7646 10.9847 5.6095 39.5502 14.3270 10.3900 10.8040 16.1459 116.9050 11.1679 19.1350 16.5278 60.9516 236.3189 54.2985 317.3965 43.8279 80.6988 21.8439 22.2875 14.2022 37.8767 20.2061 1.7287 37.7936 15.5522 48.3496 10.0415 1.2487 3.6398 19.4067 5.6231 45.7122 4.8732
temp: 298.150 k
press: 1.00000 atm
elementType: 8 8 8 7 7 6 6 6 6 6 6 6 6 6 6 6 6 6 1 1 1 1 1 1 1 1 1 1 1 1 1 1 1 1 1 1
symmnumber: 1
zpe: 770805.2 jmol-1
zpe.correction: 0.293584 hartree
zpe.thermalcorrener: 0.312676 hartree
zpe.thermalcorrenthalpy: 0.313620 hartree
zpe.thermalcorrgfe: 0.243940 hartree
zpe.sumelectzpe: -840.003250 hartree
zpe.sumelectthermal: -839.984158 hartree
zpe.sumelectthermalent: -839.983214 hartree
zpe.sumelectthermalfe: -840.052894 hartree
dipole: 4.8480 -0.6118 3.5737
dipole: 6.0538
quadrupole: -84.9634 -104.6498 -109.8792
quadrupole: 2.0427 -0.3685 -0.6576
quadrupole: 14.8674 -4.8190 -10.0484 2.0427 -0.3685 -0.6576
hfenergy: -840.2968337 hartree
pointgroup: C01 [X(C13H18N2O3)]
dipole: 1.8441777 -0.477625 1.4295564 debye
polarizability: 228.1319204|1.7412404|160.6665895|10.315668|12.3076987|108.0910303 unknown
InChI: InChI=1S/C13H18N2O3/c1-4-18-13(17)15(10-12(16)14(2)3)11-8-6-5-7-9-11/h5-9H,4,10H2,1-3H3
charge 0 multiplicity 1
36 atoms
O  1.569413 1.335404 0.293205
O  0.581024 -2.076762 -1.254907
O  -0.35517 2.446622 -0.462167
N  -0.445777 0.216925 0.332916
N  2.471837 -1.991138 0.10259
C  0.340771 -0.910777 0.880969
C  -1.871558 0.053612 0.129882
C  1.151956 -1.682746 -0.186491
C  0.182298 1.414228 0.009554
C  -2.777184 1.076379 0.508504
C  -2.357813 -1.160251 -0.415955
C  3.219331 -2.848913 -0.837429
C  3.205698 -1.49476 1.284633
C  -4.164508 0.873613 0.348747
C  -3.74929 -1.355876 -0.556295
C  -4.659317 -0.343829 -0.174685
C  2.327805 2.569783 -0.065224
C  3.792847 2.310962 0.272863
H  -0.380096 -1.629813 1.308605
H  0.973766 -0.539644 1.699649
H  -2.399083 2.02115 0.906387
H  -1.640328 -1.908622 -0.77076
H  3.613197 -3.74242 -0.317466
H  4.066254 -2.294018 -1.284269
H  2.533242 -3.160923 -1.639026
H  3.042958 -0.413275 1.420207
H  4.283871 -1.657738 1.120148
H  2.921379 -2.032046 2.210322
H  -4.859803 1.668734 0.640457
H  -4.118251 -2.294596 -0.984695
H  -5.737906 -0.496293 -0.291835
H  2.174795 2.771461 -1.140248
H  1.907555 3.41768 0.505076
H  4.394838 3.200171 0.011088
H  3.926033 2.113024 1.351141
H  4.183815 1.450594 -0.297691
