program: Gaussian 09
title: 000006559
version: EM64L-G09RevD.01
frameworkgroup: C1[X(C4H7N)]
method: RPBEPBE
basis: SDD
operation: Freq
keyword: #p
keyword: freq=noraman
keyword: PBEPBE/SDD
title: #p freq=noraman PBEPBE/SDD
converged: NO NO NO NO
title: Mulliken charges:
elementType: N C C C C H H H H H H H
charge: -0.020642 -0.108470 -0.657951 -0.657935 -0.159952 0.246267 0.233982 0.225666 0.219608 0.219631 0.225717 0.234079
chargesum: 0.00000
title: Mulliken charges with hydrogens summed into heavy atoms:
elementType: N C C C C
charge: -0.020642 0.137797 0.021306 0.021492 -0.159952
polarizability: 5.79231979e+01 1.88735541e-02 4.19368772e+01 2.53100022e+00 3.70311545e-03 3.71095679e+01
1716.lowfreq: -17.3444 -0.0011 -0.0010 -0.0008 4.5049 21.2934 183.6850 211.4122 216.5771
frequency: 183.6307 211.3676 216.5752 274.0166 343.9420 539.7898 553.9876 757.1356 921.4749 927.1189 962.6984 1109.6280 1118.5936 1172.8861 1280.8307 1315.0374 1381.7226 1399.4896 1465.4906 1469.9356 1478.4297 1488.0857 2180.9077 2986.4049 2989.1066 2990.7504 3088.6033 3093.7555 3097.8531 3101.8472
redmass: 4.0973 1.0353 1.5988 1.6783 2.3898 3.7847 5.6699 3.0341 2.3084 1.1647 1.4584 1.5764 2.5226 1.7960 1.3440 1.4418 1.1834 1.1938 1.0437 1.0485 1.0423 1.0527 12.5347 1.0828 1.0346 1.0349 1.1012 1.1003 1.1015 1.1009
irintensity: 2.3484 0.0024 0.8804 0.3170 0.3050 2.2406 1.0789 0.3495 2.4572 5.0541 0.1676 12.6263 5.1799 7.3411 0.0257 3.3687 15.5583 9.1960 4.5868 4.3009 16.6688 18.4951 9.8686 7.5563 21.9618 20.3506 1.2387 50.7162 19.4379 34.9250
temp: 298.150 k
press: 1.00000 atm
elementType: 7 6 6 6 6 1 1 1 1 1 1 1
symmnumber: 1
zpe: 263783.1 jmol-1
zpe.correction: 0.100470 hartree
zpe.thermalcorrener: 0.106531 hartree
zpe.thermalcorrenthalpy: 0.107475 hartree
zpe.thermalcorrgfe: 0.071623 hartree
zpe.sumelectzpe: -210.963851 hartree
zpe.sumelectthermal: -210.957790 hartree
zpe.sumelectthermalent: -210.956846 hartree
zpe.sumelectthermalfe: -210.992698 hartree
dipole: -4.0717 0.0070 -0.7176
dipole: 4.1345
quadrupole: -39.7037 -29.8671 -30.0338
quadrupole: 0.0108 -0.7212 0.0008
quadrupole: -6.5022 3.3344 3.1677 0.0108 -0.7212 0.0008
hfenergy: -211.064321 hartree
pointgroup: C01 [X(C4H7N1)]
dipole: -1.6067897 0.002097 0.2532301 debye
dipolederiv: -0.3384049 -0.0023472 -0.0233152 -0.0001282 -0.2231425 0.0000304 0.0295636 0.0002084 -0.2334982 0.0935385 0.0001569 0.0108589 -0.0010964 0.1745532 -0.0000137 0.0009174 -0.0000059 0.2446727 0.0124293 0.0039781 -0.0036124 -0.0441216 -0.0053727 0.0292139 0.0222472 0.0076951 0.075295 0.0113587 -0.0040516 -0.0035849 0.0447514 -0.0053829 -0.029181 0.0227772 -0.0076309 0.075222 0.191209 0.0021311 -0.0358589 0.0014114 -0.1337224 -0.0000523 -0.0922265 -0.0000228 -0.0708977 0.0237675 0.0000455 -0.0045397 -0.0001507 0.0662448 -0.0000368 0.0034312 -0.0000948 -0.107779 0.0689948 -0.0898287 -0.0537203 -0.0569794 -0.0958846 -0.0543785 -0.0405878 -0.0756174 0.0616911 0.0963512 0.0187393 0.0338907 0.0161629 0.0783264 -0.027456 -0.0024346 0.0303068 -0.1339887 -0.1623807 0.0279082 0.0498597 0.0019532 0.0808791 0.0217988 0.0498078 0.0175836 0.0807058 -0.1620326 -0.0279087 0.0498686 -0.0026568 0.0808453 -0.0217408 0.0495391 -0.0176626 0.0807545 0.0963899 -0.0187577 0.0339099 -0.0161364 0.0783001 0.0274892 -0.0024166 -0.0302758 -0.1338842 0.0687794 0.0899349 -0.0537564 0.0569906 -0.0956438 0.0543269 -0.040618 0.0755163 0.0617067 unknown
polarizability: 58.0078352|-0.0675544|41.9371375|-2.1521098|0.0118563|37.0246704 unknown
InChI: InChI=1S/C4H7N/c1-4(2)3-5/h4H,1-2H3
charge 0 multiplicity 1
12 atoms
N  2.081378 -0.00513 -0.127355
C  -0.54479 0.000707 0.386806
C  -1.207507 1.285959 -0.178473
C  -1.205914 -1.28532 -0.178558
C  0.909546 0.001815 0.107094
H  -0.659572 0.000581 1.49025
H  -0.743421 2.193542 0.243744
H  -1.109095 1.322563 -1.277776
H  -2.282582 1.287885 0.076675
H  -2.281029 -1.288541 0.076404
H  -1.107282 -1.32181 -1.277847
H  -0.740831 -2.192352 0.243736
