program: Gaussian 09
title: 000058196
version: EM64L-G09RevD.01
frameworkgroup: C1[X(C20H28N2O2)]
method: RPBEPBE
basis: SDD
operation: Freq
keyword: #p
keyword: freq=noraman
keyword: PBEPBE/SDD
title: #p freq=noraman PBEPBE/SDD
converged: YES YES NO NO
title: Mulliken charges:
elementType: O O N N C C C C C C C C C C C C C C C C C C C C H H H H H H H H H H H H H H H H H H H H H H H H H H H H
charge: -0.199920 -0.219661 -0.413968 -0.352973 -0.278525 0.098042 -0.400182 0.253962 0.521070 0.283079 -0.586573 -0.551517 -0.430024 -0.388723 -0.441655 -0.423265 0.160037 0.163689 -0.448475 -0.457357 -0.381715 -0.379943 -0.686134 -0.686808 0.271850 0.190830 0.258041 0.233871 0.227381 0.212017 0.222355 0.218115 0.192926 0.226596 0.198568 0.205331 0.279188 0.205946 0.219937 0.234194 0.222335 0.235978 0.244641 0.202987 0.200482 0.246751 0.210757 0.211222 0.227767 0.227317 0.209941 0.210219
chargesum: 0.00000
title: Mulliken charges with hydrogens summed into heavy atoms:
elementType: O O N N C C C C C C C C C C C C C C C C C C C C
charge: -0.199920 -0.219661 -0.134781 -0.352973 -0.006675 0.098042 0.048689 0.253962 0.521070 0.283079 -0.125321 -0.117145 -0.018983 -0.162127 -0.037756 -0.217319 0.160037 0.163689 0.005655 0.000956 0.065913 0.067290 -0.036388 -0.039331
polarizability: 2.80152040e+02 -1.23971923e+01 2.43707723e+02 -1.05941208e+01 1.27235326e+01 1.79969216e+02
1716.lowfreq: -0.0004 0.0006 0.0007 3.9090 6.5048 7.2398 17.1142 24.0339 31.9524
frequency: 16.5977 24.0036 31.7921 39.7247 61.7926 76.9233 78.8177 88.2066 95.0471 100.2511 110.5095 130.1535 150.6414 187.1039 200.0915 204.6452 234.6510 236.4111 241.7315 243.9906 253.1189 258.9821 282.2156 332.0586 354.5340 374.7036 383.4247 393.5551 415.0882 429.7064 440.8166 462.3279 469.2271 502.9023 520.2415 564.7165 569.4644 592.3587 605.2027 643.1554 665.5136 704.0560 718.6587 731.8942 740.6371 753.5071 756.5967 791.3937 817.2744 840.0966 857.5405 878.8474 882.7785 887.3102 892.2301 897.3253 916.0583 941.4700 955.9169 988.0483 1007.0207 1020.8078 1033.2862 1041.4055 1053.7372 1060.2802 1068.2169 1078.1887 1088.1228 1090.4277 1092.7767 1098.0010 1134.2039 1135.3857 1150.0394 1157.4407 1170.9498 1173.2082 1185.6958 1194.5179 1218.3777 1220.3871 1231.6854 1236.5686 1250.9710 1270.7505 1274.6206 1274.9272 1286.3542 1300.7096 1310.2114 1312.5081 1319.9411 1330.8292 1335.6833 1336.1649 1337.5641 1347.3916 1352.6801 1374.3191 1391.7185 1393.2780 1414.3082 1438.5127 1442.3003 1443.8128 1454.9210 1457.1895 1460.7327 1466.3612 1475.2313 1475.5248 1477.7409 1477.9932 1485.6088 1486.7356 1493.0168 1573.8825 1614.0734 1625.3945 1679.6408 1712.8082 2876.7061 2910.8957 2919.6504 2922.9609 2933.1665 2948.4256 2973.9024 2975.6041 2983.6066 2987.6261 2994.3316 2999.8920 3000.4756 3011.9126 3016.5985 3021.4883 3047.9382 3048.6369 3066.1378 3071.4098 3072.2725 3076.6954 3077.1709 3085.4753 3089.1947 3113.8758 3116.8171 3553.5500
redmass: 3.8799 4.2375 4.1129 4.7990 2.6408 1.9467 2.3888 2.6196 3.0051 3.2381 4.3565 4.1771 2.7336 3.5290 3.2629 3.4330 1.4097 1.2032 2.1314 2.2444 3.0361 2.0470 2.7525 4.1708 3.3991 3.0086 3.2600 3.4301 5.9092 1.8890 4.9719 2.7522 2.7898 3.9666 3.7800 4.4784 2.8171 3.3120 3.7859 2.5928 3.0130 3.7611 5.0342 5.2688 1.7085 1.1477 1.1260 4.5678 1.4542 2.0552 2.5056 1.4051 1.4409 2.2983 1.6526 2.5901 2.2818 1.8063 2.4042 3.8489 2.4231 2.3318 2.3546 2.3224 2.7091 2.8581 2.0963 1.8354 1.9243 2.0106 1.8950 2.1648 1.8353 2.8047 1.4156 2.1098 1.4662 2.8763 1.3788 1.2061 1.5394 1.3429 1.3117 1.4920 2.2147 1.3908 1.3122 1.2067 1.3681 1.4850 1.2677 1.4711 1.6193 1.4464 1.4833 1.4528 2.1200 1.4693 1.7535 2.2860 1.2136 1.2109 3.0275 1.1088 1.0906 1.0979 1.1288 1.0888 1.1512 1.3350 1.0497 1.0504 1.0449 1.0448 1.0791 1.0808 1.1186 9.8837 10.0214 5.9647 7.8466 8.3346 1.0721 1.0708 1.0789 1.0609 1.0648 1.0954 1.0360 1.0358 1.0647 1.0639 1.0628 1.0620 1.0663 1.0931 1.0828 1.0900 1.0955 1.0966 1.0991 1.0997 1.1027 1.0990 1.0990 1.1008 1.1015 1.0911 1.0921 1.0761
irintensity: 0.1033 0.9569 0.0984 0.2165 1.5110 0.4951 2.2770 1.5814 0.7185 0.9861 4.4311 5.0201 2.7433 9.9600 3.2447 1.8377 2.1759 0.4250 5.7607 0.7084 6.6090 0.0691 0.8042 2.8010 0.2373 1.9017 0.3339 13.6542 13.0406 28.4622 8.6877 16.6443 18.0228 10.9983 4.3771 5.3896 2.7959 3.6207 4.9092 17.0933 5.0480 3.5566 11.7788 14.6538 52.9520 7.1335 8.9394 2.4267 6.9644 3.9585 4.1226 10.7584 12.3643 18.0625 10.7748 2.1547 1.4828 1.2983 3.1263 33.1149 2.9190 14.2559 2.5310 1.4962 12.7470 0.2083 1.3430 16.1131 6.5315 14.4203 31.4507 11.1978 7.3889 8.0312 3.3901 19.6752 24.4073 272.2735 15.0143 4.0334 39.8443 13.0974 2.9286 13.2845 101.5919 15.8308 54.0275 19.4978 6.5744 22.9267 34.2953 51.1647 24.5955 4.5159 17.6072 27.7036 65.5330 35.6954 24.4335 1.8637 8.1636 9.6897 31.8986 7.7409 3.2877 14.5290 10.5177 6.1071 2.0244 5.6704 4.1990 6.0332 11.6643 13.9342 16.9233 15.0214 5.0273 298.0430 19.6289 97.1497 28.7543 7.4869 128.0964 64.5683 8.5398 44.2552 52.1422 19.6325 35.2214 40.8098 2.3610 3.4566 38.5598 41.1760 22.3741 59.9080 70.4871 52.5457 4.7977 2.1610 6.7758 14.1664 33.8487 53.3935 25.3626 54.9293 59.6334 35.1779 24.7047 7.1259
temp: 298.150 k
press: 1.00000 atm
elementType: 8 8 7 7 6 6 6 6 6 6 6 6 6 6 6 6 6 6 6 6 6 6 6 6 1 1 1 1 1 1 1 1 1 1 1 1 1 1 1 1 1 1 1 1 1 1 1 1 1 1 1 1
symmnumber: 1
zpe: 1159250.8 jmol-1
zpe.correction: 0.441535 hartree
zpe.thermalcorrener: 0.466275 hartree
zpe.thermalcorrenthalpy: 0.467219 hartree
zpe.thermalcorrgfe: 0.385324 hartree
zpe.sumelectzpe: -1037.034912 hartree
zpe.sumelectthermal: -1037.010173 hartree
zpe.sumelectthermalent: -1037.009229 hartree
zpe.sumelectthermalfe: -1037.091123 hartree
dipole: -2.8935 0.6600 0.4581
dipole: 3.0029
quadrupole: -128.7962 -132.6393 -155.1588
quadrupole: 0.6632 1.0638 12.3320
quadrupole: 10.0686 6.2255 -16.2940 0.6632 1.0638 12.3320
hfenergy: -1037.4764476 hartree
pointgroup: C01 [X(C20H28N2O2)]
dipole: 1.1261979 -0.3254546 0.1468653 debye
polarizability: 279.0794008|-14.7993068|245.7880376|7.2898128|-11.2814113|178.9615407 unknown
InChI: InChI=1S/C20H28N2O2/c1-3-6-18(23)22(19(24)7-4-2)17-11-10-14-8-5-9-16-20(14)15(17)12-13-21-16/h9,11,15,21H,3-8,10,12-13H2,1-2H3
charge 0 multiplicity 1
52 atoms
O  1.701471 1.288202 1.751785
O  1.145609 -1.207409 -2.149151
N  -3.168329 -1.738797 1.401007
N  1.426697 0.144388 -0.274925
C  -1.040203 -0.4474 -0.043082
C  -2.435651 0.17503 0.004348
C  -0.762017 -1.186897 1.297076
C  -2.709538 1.440215 -0.434904
C  0.025873 0.575843 -0.394209
C  -3.534181 -0.6524 0.583429
C  -1.63662 2.374118 -0.954011
C  -4.124167 1.997039 -0.334945
C  -1.812483 -2.294844 1.480922
C  -0.235607 1.834586 -0.814967
C  -5.183199 0.887245 -0.520501
C  -4.84786 -0.31878 0.339487
C  2.236944 0.779645 0.732175
C  1.83985 -0.92259 -1.134291
C  3.734697 0.955386 0.461667
C  3.033572 -1.795102 -0.729478
C  4.118729 2.457942 0.566425
C  2.668719 -3.300496 -0.831745
C  5.637415 2.673591 0.405822
C  3.882392 -4.205441 -0.537955
H  -1.034066 -1.225349 -0.840293
H  0.244356 -1.645552 1.28486
H  -0.796653 -0.469356 2.135985
H  -1.832482 2.62198 -2.021765
H  -1.713574 3.349918 -0.424068
H  -4.271842 2.801483 -1.082166
H  -4.252569 2.466248 0.666335
H  -1.685936 -2.780883 2.467165
H  -1.639574 -3.077612 0.702764
H  0.595862 2.504289 -1.070802
H  -6.184662 1.279702 -0.260536
H  -5.228142 0.600408 -1.59651
H  -3.931684 -2.319411 1.748735
H  -5.663202 -0.94508 0.724087
H  4.306657 0.399114 1.23004
H  4.024478 0.568334 -0.52889
H  3.873138 -1.594067 -1.424528
H  3.382789 -1.567203 0.29141
H  3.774523 2.839022 1.54435
H  3.573798 3.03029 -0.210192
H  1.84928 -3.52701 -0.120911
H  2.272978 -3.497561 -1.843634
H  6.200854 2.136215 1.191864
H  5.998324 2.312522 -0.575643
H  5.892432 3.745974 0.483155
H  3.605321 -5.27247 -0.612879
H  4.282178 -4.032824 0.479203
H  4.701106 -4.019297 -1.258615
