program: Gaussian 09
title: 000058049
version: EM64L-G09RevD.01
frameworkgroup: C1[X(C9H16N2O2S)]
method: RPBEPBE
basis: SDD
operation: Freq
keyword: #p
keyword: freq=noraman
keyword: PBEPBE/SDD
title: #p freq=noraman PBEPBE/SDD
converged: YES YES NO NO
title: Mulliken charges:
elementType: S O O N N C C C C C C C C C H H H H H H H H H H H H H H H H
charge: 0.280607 -0.270938 -0.293826 -0.110539 -0.086838 0.335427 -0.293737 -0.698275 -0.086892 -0.715979 -0.703826 -0.715188 -0.629535 0.169949 0.240098 0.232100 0.280620 0.263007 0.220892 0.206796 0.270043 0.228675 0.229031 0.199191 0.270801 0.206408 0.220362 0.225487 0.298061 0.228016
chargesum: 0.00000
title: Mulliken charges with hydrogens summed into heavy atoms:
elementType: S O O N N C C C C C C C C C
charge: 0.280607 -0.270938 -0.293826 -0.110539 -0.086838 0.335427 0.178461 -0.154648 -0.086892 -0.018248 -0.046929 -0.017616 0.122029 0.169949
polarizability: 2.14829721e+02 2.25546663e-01 1.34699077e+02 -1.68320826e+00 -2.35008870e-01 9.27138816e+01
1716.lowfreq: -9.3223 -0.0024 -0.0020 0.0008 4.9295 10.3798 30.6810 47.0226 76.2570
frequency: 30.6410 46.9421 76.2489 112.7501 120.6131 135.9296 147.2202 174.6381 183.1476 192.4582 211.7626 238.8516 245.8268 252.1270 305.3968 317.2979 336.3692 386.0362 409.9795 436.3598 440.1515 486.3967 507.8339 599.9072 624.9583 652.9658 705.3782 718.0813 751.1080 813.7227 838.2341 914.0981 917.8313 921.9510 954.0811 960.7456 1004.5420 1006.6735 1028.7896 1034.4594 1073.2049 1114.5005 1150.1497 1165.8673 1185.1512 1226.5345 1238.8192 1254.9536 1270.7269 1280.9138 1317.4282 1372.5283 1375.6939 1397.3198 1397.8691 1419.2038 1444.1898 1453.0589 1465.8384 1466.2492 1468.2118 1471.8500 1480.0448 1481.6138 1488.3664 1501.8999 1536.2399 1613.2765 2954.2917 2968.2956 2987.2646 2988.9858 2994.3193 3037.1714 3049.4061 3054.0452 3079.3807 3082.5296 3095.7989 3098.5387 3111.2921 3114.9935 3119.2986 3133.7317
redmass: 3.7544 3.6211 4.8874 3.3108 2.5360 2.3047 1.6291 1.3247 1.9475 3.9083 3.5828 1.0909 1.1094 3.0499 3.0937 4.3108 2.5894 4.8219 2.8277 3.5479 3.0312 4.2896 4.0469 10.5725 5.8729 4.4257 5.8814 12.1163 6.1033 3.2476 1.8808 1.5992 2.0569 2.0044 1.2081 7.3511 1.6478 2.1775 1.4189 1.4288 1.9734 1.2342 1.8480 1.7048 1.4659 2.8546 2.3820 3.0051 2.9160 1.6087 1.7301 1.2302 1.2355 2.2623 1.2302 1.2330 1.0467 1.0980 1.0908 1.0687 1.0677 1.0809 1.0519 1.0896 1.1320 1.0778 5.9072 7.0444 1.0651 1.0378 1.0360 1.0357 1.0361 1.0884 1.0997 1.0667 1.0993 1.0990 1.0993 1.1003 1.1003 1.0996 1.0985 1.1085
irintensity: 1.4590 5.2175 3.4900 0.1076 0.1663 1.7329 1.3462 0.0534 0.2774 6.2645 0.3614 0.3744 1.2862 4.1543 4.2360 23.9171 2.6472 14.8539 0.2884 1.7417 2.9052 13.1917 8.3886 2.0296 2.3800 1.0002 1.5118 16.5713 4.5174 11.1524 6.3013 0.9796 6.8188 20.9047 1.1836 188.5467 6.3235 31.6135 0.1768 10.7188 268.2494 1.2936 437.4403 295.4717 49.5817 262.4644 95.2995 28.3067 19.2688 40.8184 49.3635 43.7488 45.9614 85.8811 51.7686 116.9955 0.9184 16.4999 33.0034 12.5164 6.0130 2.2825 4.3191 34.9823 24.5764 37.6540 113.9203 798.9928 56.7752 97.8985 27.0844 10.7102 41.4104 11.8777 34.0910 42.6921 10.8776 21.9480 62.7603 30.6739 5.0414 18.5280 0.6281 12.0847
temp: 298.150 k
press: 1.00000 atm
elementType: 16 8 8 7 7 6 6 6 6 6 6 6 6 6 1 1 1 1 1 1 1 1 1 1 1 1 1 1 1 1
symmnumber: 1
zpe: 641339.3 jmol-1
zpe.correction: 0.244273 hartree
zpe.thermalcorrener: 0.260478 hartree
zpe.thermalcorrenthalpy: 0.261422 hartree
zpe.thermalcorrgfe: 0.200500 hartree
zpe.sumelectzpe: -1009.470560 hartree
zpe.sumelectthermal: -1009.454355 hartree
zpe.sumelectthermalent: -1009.453411 hartree
zpe.sumelectthermalfe: -1009.514332 hartree
dipole: 3.7840 1.8261 -0.2539
dipole: 4.2092
quadrupole: -60.6101 -94.1844 -91.6096
quadrupole: 3.9789 -0.2016 1.4740
quadrupole: 21.5246 -12.0497 -9.4749 3.9789 -0.2016 1.4740
hfenergy: -1009.714833 hartree
pointgroup: C01 [X(C9H16N2O2S1)]
dipole: 1.5648072 -0.2390206 0.486516 debye
polarizability: 213.7768147|5.1374238|106.2302304|-7.6651316|-20.0019912|122.2356339 unknown
InChI: InChI=1S/C9H16N2O2S/c1-9(2,3)13-8(12)10-7-11(4)5-6-14-7/h5-6H2,1-4H3
charge 0 multiplicity 1
30 atoms
S  1.943681 1.244791 -1.62776
O  -1.66462 -0.158872 0.755703
O  -0.797221 0.744713 -1.242357
N  2.939483 -0.108327 0.47049
N  0.586403 -0.13208 0.484054
C  -3.116959 0.078662 0.357384
C  4.139997 0.180662 -0.339925
C  3.807422 1.389711 -1.230402
C  1.721041 0.233364 -0.073433
C  -3.442989 -0.73585 -0.911173
C  -3.867649 -0.466293 1.584901
C  -3.360457 1.58999 0.170673
C  3.043403 -0.981013 1.648074
C  -0.635771 0.206614 -0.103189
H  4.402688 -0.705941 -0.955605
H  4.991081 0.399687 0.33033
H  3.968807 2.345305 -0.708336
H  4.363425 1.372696 -2.178703
H  -3.19119 -1.800544 -0.75869
H  -4.525348 -0.664131 -1.125107
H  -2.883054 -0.355144 -1.779746
H  -3.578688 0.090151 2.493092
H  -3.629347 -1.532446 1.741471
H  -4.957752 -0.363987 1.437099
H  -2.794971 1.976192 -0.691723
H  -4.437986 1.769912 0.000539
H  -3.057216 2.142455 1.077862
H  3.445104 -1.974948 1.36805
H  2.032768 -1.105441 2.06504
H  3.709114 -0.526489 2.404587
