program: Gaussian 09
title: 000058044
version: EM64L-G09RevD.01
frameworkgroup: C1[X(C7H10N4O4)]
method: RPBEPBE
basis: SDD
operation: Freq
keyword: #p
keyword: freq=noraman
keyword: PBEPBE/SDD
title: #p freq=noraman PBEPBE/SDD
converged: NO YES NO YES
title: Mulliken charges:
elementType: O O O O N N N N C C C C C C C H H H H H H H H H H
charge: -0.318589 -0.189369 -0.212890 -0.241077 -0.234991 -0.415590 -0.041419 0.042152 0.275761 0.340715 -0.606842 -0.324418 0.286013 -0.218215 -0.670845 0.278978 0.278857 0.190210 0.293167 0.339285 0.234954 0.234947 0.219050 0.230077 0.230083
chargesum: 0.00000
title: Mulliken charges with hydrogens summed into heavy atoms:
elementType: O O O O N N N N C C C C C C C
charge: -0.318589 -0.189369 -0.212890 -0.241077 -0.234991 -0.076305 -0.041419 0.042152 0.275761 0.340715 0.141202 -0.031250 0.286013 0.251685 0.008364
polarizability: 2.23434123e+02 -5.46235064e+00 1.25460324e+02 2.93844766e-03 4.46107898e-03 6.18474299e+01
1716.lowfreq: -77.2235 -36.2422 -10.4116 -5.2468 -3.9576 -0.0010 -0.0007 -0.0005 29.7836
frequency: -77.1842 -32.3109 29.4682 47.5675 68.6590 74.9033 104.3002 151.2239 169.4921 213.4391 221.6171 246.4049 268.3964 321.7385 331.3662 360.5053 384.7885 445.7872 563.8682 575.6151 582.4520 658.0902 677.1445 694.3040 706.4702 708.2563 748.7343 782.9130 798.2718 868.3579 875.8596 907.3410 983.6308 1042.5067 1098.8252 1109.0264 1117.8617 1125.6646 1132.7185 1139.6649 1199.2387 1212.9146 1251.7765 1303.3442 1319.0657 1334.7821 1355.5492 1376.0209 1398.8975 1452.4156 1459.3794 1463.4537 1474.8415 1477.9477 1485.7434 1488.8610 1495.3641 1572.4714 1703.8304 2998.3031 3012.0326 3022.6354 3071.4156 3096.0652 3109.7418 3120.7880 3128.4662 3254.4531 3558.0677
redmass: 1.5459 2.2820 3.9540 4.7259 4.9788 3.3514 3.2302 3.5308 5.5998 8.6517 5.5976 1.2227 4.7985 5.2833 6.1351 4.5481 4.5596 7.7514 5.9247 1.9687 1.9478 5.8855 7.9869 9.2590 7.1113 9.0872 11.1221 4.7334 1.0953 1.4197 4.3352 4.5094 3.0700 3.5282 2.9331 2.9516 1.3161 3.3668 2.0138 1.4701 2.3066 4.3626 1.1271 4.2218 6.5165 9.9508 1.4689 2.9412 1.2724 1.0379 1.3084 1.0405 1.2272 1.8794 1.6710 1.0824 1.9742 5.0923 8.8228 1.0357 1.0580 1.0337 1.1070 1.0986 1.1029 1.1006 1.1029 1.0997 1.0755
irintensity: 0.1407 0.2808 2.6731 0.5800 0.0032 0.8509 7.4861 1.3762 10.0454 1.0668 0.1049 0.8517 1.4462 12.7633 10.0370 0.6375 3.9287 2.3059 1.6974 29.7696 37.8085 2.6380 13.0216 13.8821 15.9292 39.1220 8.3754 3.4050 3.9786 21.9268 0.0287 4.2570 50.1412 289.8429 62.5317 239.5579 1.1231 722.3240 2.6797 5.3534 202.9305 4.5205 0.0052 179.1953 204.4930 131.7303 5.3044 12.2921 23.2843 15.2268 6.3046 12.6970 13.8475 33.6507 87.3674 16.7541 106.8915 967.2754 255.7779 19.5846 21.3592 26.7104 6.5443 28.2864 43.6868 15.5419 5.5697 3.4767 38.7091
temp: 298.150 k
press: 1.00000 atm
elementType: 8 8 8 8 7 7 7 7 6 6 6 6 6 6 6 1 1 1 1 1 1 1 1 1 1
symmnumber: 1
zpe: 481706.9 jmol-1
zpe.correction: 0.183472 hartree
zpe.thermalcorrener: 0.197221 hartree
zpe.thermalcorrenthalpy: 0.198165 hartree
zpe.thermalcorrgfe: 0.141182 hartree
zpe.sumelectzpe: -791.422156 hartree
zpe.sumelectthermal: -791.408407 hartree
zpe.sumelectthermalent: -791.407463 hartree
zpe.sumelectthermalfe: -791.464447 hartree
dipole: 6.2307 4.6146 0.0013
dipole: 7.7534
quadrupole: -99.0646 -90.4816 -85.4244
quadrupole: 6.8739 -0.0011 -0.0057
quadrupole: -7.4077 1.1752 6.2325 6.8739 -0.0011 -0.0057
hfenergy: -791.6056285 hartree
pointgroup: C01 [X(C7H10N4O4)]
dipole: -2.4408455 -1.82959 0.0003771 debye
dipolederiv: -2.1207025 -0.2760625 0.0002115 -0.6704872 -0.632872 0.0002156 0.0004074 0.0001756 -0.3117799 -0.7733496 0.1138254 -0.000021 0.3089555 -0.8990022 0.0003396 -0.000084 0.0003741 -0.2932646 -1.0775149 -0.1512307 -0.0000305 -0.4864898 -0.5342561 -0.0001136 0.0005453 0.0002078 -0.2423036 -0.6458165 0.1062587 0.0000481 0.4377752 -0.8887809 0.0000484 0.0003562 -0.0004694 -0.2513911 -0.1484218 -0.0503914 -0.0001011 0.2030011 -0.7189112 -0.0001573 -0.000084 -0.0003071 -0.0941318 -2.6613024 0.1940957 0.0000669 0.1460072 -0.4034891 -0.0000602 -0.0002808 -0.0000438 -0.3348533 -0.9943433 -0.0321422 0.0001407 -0.8061677 -0.3835643 0.000008 0.0000264 -0.0001202 -0.238559 2.3019549 -0.2018911 -0.0002323 -0.2845824 1.2368438 0.0000866 -0.0010012 0.000202 0.2214851 1.802796 -0.061558 -0.0002075 1.2124232 0.4927029 0.0001151 -0.0000885 0.0002732 0.184972 -1.1660443 0.4726746 0.0004017 0.7530297 -0.002352 -0.0001151 0.0003844 -0.0000696 0.0349442 0.1779063 0.0458047 0.0002854 -0.0283472 0.3828716 -0.0001558 0.0004417 -0.0002264 0.1808062 0.7962788 -0.0999146 -0.0001867 -0.3402129 0.1778915 0.0001661 -0.0002154 0.0000926 -0.0766842 3.1300534 -0.0890782 -0.0000698 -0.3690557 1.4775447 -0.000645 -0.0001427 -0.0006519 0.3167914 1.2251485 0.0750824 -0.0000592 -0.1411922 0.2362152 0.0000622 0.0000606 0.0000516 0.3531228 -0.1250411 -0.0871963 0.0000544 -0.0536413 -0.0169451 0.0000526 0.0000351 0.0000527 0.0646574 0.081069 0.0600547 0.0686613 -0.0004078 0.0359305 -0.0078135 0.043602 -0.0397876 -0.0066095 0.0812553 0.0597468 -0.0683463 -0.0002654 0.0354331 0.0080434 -0.0435623 0.0403072 -0.0071524 -0.1402037 -0.1309246 -0.0005004 -0.0218114 0.0646511 0.0000343 -0.0003025 0.0000079 0.1156848 0.0775434 -0.0203591 0.0000002 -0.0387085 0.0999191 -0.0000459 -0.0000436 -0.0000336 0.1777036 0.2327393 0.0227292 -0.0000848 0.0392947 0.1616576 0.0000474 0.0000316 0.0000715 0.3221417 -0.0708146 -0.0289679 -0.0148734 0.0665084 0.0046842 -0.0893395 0.0241978 -0.0988252 -0.0550697 -0.0708383 -0.0289473 0.0149053 0.0664815 0.0048918 0.0892726 -0.0242742 0.0987676 -0.0553002 -0.1589261 0.0500332 -0.000025 0.0674628 0.0567752 0.000035 -0.0000378 0.0000337 0.1193787 0.1232865 0.0292052 0.0462756 -0.029777 0.0059576 -0.0986681 0.0180655 -0.1139366 -0.062175 0.1232877 0.0291533 -0.046313 -0.0297929 0.0062031 0.0985871 -0.0180373 0.1138541 -0.0624137 unknown
polarizability: 223.4937322|-4.898305|125.4007123|-0.0163506|0.0076697|61.8474319 unknown
InChI: InChI=1S/C7H10N4O4/c1-3-15-7(12)9-6-8-4-5(10(6)2)11(13)14/h4,9H,3H2,1-2H3
charge 0 multiplicity 1
25 atoms
O  -3.36221 -0.485443 0.000405
O  -2.478887 1.702245 -0.00075
O  4.665566 0.730643 -0.000579
O  4.008977 -1.470404 -0.000688
N  1.270043 -0.626401 -0.000293
N  -1.130969 -0.274198 0.000265
N  0.514191 1.541861 0.000736
N  3.752104 -0.189465 0.000064
C  0.164215 0.225919 0.000202
C  2.394725 0.238592 0.000069
C  1.277315 -2.102824 -0.001254
C  1.895278 1.549746 0.000592
C  -2.327872 0.469925 -0.000089
C  -4.745253 0.078073 0.000087
C  -5.703512 -1.107787 0.000779
H  1.799354 -2.484882 -0.890969
H  1.796456 -2.486199 0.889615
H  0.242316 -2.481005 -0.003329
H  2.468215 2.472783 0.000987
H  -1.274815 -1.285143 0.000746
H  -4.859697 0.715449 0.895222
H  -4.859712 0.714419 -0.895778
H  -6.745831 -0.741244 0.000584
H  -5.557514 -1.735245 -0.894763
H  -5.557485 -1.734214 0.897039
