program: Gaussian 09
title: 000006548
version: EM64L-G09RevD.01
frameworkgroup: C1[X(C10H22O)]
method: RPBEPBE
basis: SDD
operation: Freq
keyword: #pfreq=noraman
keyword: PBEPBE/SDD
title: #p freq=noraman PBEPBE/SDD
converged: YES YES NO NO
title: Mulliken charges:
elementType: O C C C C C C C C C C H H H H H H H H H H H H H H H H H H H H H H
charge: -0.463748 0.336841 -0.426074 -0.413136 -0.367582 -0.023618 -0.443178 -0.742142 -0.714996 -0.714924 -0.714336 0.208132 0.192421 0.218732 0.171609 0.192153 0.186793 0.191690 0.195917 0.221117 0.231217 0.203242 0.226284 0.218388 0.204142 0.212312 0.206015 0.214072 0.212206 0.224848 0.216780 0.220148 0.318675
chargesum: 0.00000
title: Mulliken charges with hydrogens summed into heavy atoms:
elementType: O C C C C C C C C C C
charge: -0.145073 0.336841 -0.025521 -0.022795 0.011364 0.168072 -0.026144 -0.081399 -0.080154 -0.082631 -0.052560
polarizability: 1.30229947e+02 1.52904160e-01 1.07054332e+02 -2.12617368e+00 1.05501920e+00 1.00299969e+02
1716.lowfreq: -13.5868 -0.0007 -0.0006 0.0006 3.3064 11.5228 31.1912 39.7506 77.4593
frequency: 27.8410 39.0190 77.4144 90.0430 102.3339 136.7096 179.7868 197.9004 207.3533 229.2138 241.2354 248.6984 267.8353 290.8790 332.7609 352.9399 377.1763 405.0460 432.2278 457.0243 472.0345 528.1551 718.7668 730.1857 776.4167 804.0342 827.2310 872.3721 913.0382 914.1062 939.1713 953.0273 973.1566 991.8073 1017.3615 1041.3158 1053.7928 1063.6132 1074.0706 1106.6412 1138.7461 1164.3374 1176.4819 1197.7622 1220.9074 1237.7147 1266.7995 1284.5790 1292.0621 1300.7057 1318.0618 1333.0240 1335.3421 1347.3391 1368.3517 1377.3007 1385.9486 1388.4540 1393.7517 1447.1674 1453.7677 1462.6814 1465.6326 1469.2783 1470.6566 1473.9870 1480.3808 1481.7320 1483.8652 1488.2248 1489.8346 2945.1345 2948.4487 2956.5294 2965.4772 2966.8088 2970.1436 2973.7776 2980.9102 2991.9444 2998.8394 3018.0258 3026.5053 3042.3485 3057.1822 3064.6491 3067.3188 3072.5428 3073.0481 3078.1072 3093.0554 3093.6160 3544.4532
redmass: 2.6229 2.9693 2.5231 2.6104 1.7674 1.9887 1.0609 1.9019 1.2379 1.9545 1.1419 1.8103 2.1238 1.0819 2.3464 2.6633 2.2177 2.7662 2.3130 2.4671 2.8606 2.7698 3.1310 1.1640 1.2350 2.0078 1.8813 1.9839 1.5390 1.3041 1.7356 1.3892 1.8306 1.5723 1.5751 3.2316 1.7207 2.3127 1.6756 1.6023 2.1488 2.1703 1.7651 1.7294 1.6775 1.3056 1.4363 1.3423 1.3138 1.1243 1.4975 1.4127 1.4567 1.5824 1.5260 1.2292 1.3654 1.2102 1.2145 1.0781 1.0727 1.0588 1.0629 1.0476 1.0621 1.0855 1.0537 1.0545 1.0526 1.0612 1.0516 1.0623 1.0723 1.0707 1.0355 1.0632 1.0367 1.0586 1.0365 1.0358 1.0946 1.1005 1.0970 1.1023 1.0992 1.0989 1.0993 1.0986 1.0989 1.1002 1.0995 1.0995 1.0654
irintensity: 0.2492 0.3368 0.3154 0.0339 0.3568 2.3046 4.4768 0.1686 0.0515 3.2043 1.4686 3.1724 0.9571 138.9042 4.3031 6.5750 0.7881 8.6861 2.0320 1.8916 6.4607 4.4035 4.0980 4.3965 10.9730 7.7618 0.9342 23.5354 1.1140 6.3462 4.2544 0.6135 22.9623 4.1791 8.8227 0.7973 3.0603 1.0938 3.2144 41.3160 13.4386 15.9213 11.1834 9.2952 11.5209 13.7096 3.1193 10.1781 8.9504 5.7424 17.6965 2.8755 3.0032 0.8665 8.6157 17.5872 32.4184 22.3949 16.3912 2.7257 1.1896 0.5428 7.4489 1.6074 1.1423 15.0746 17.5356 8.5353 6.8858 10.3354 22.4883 3.4832 6.1165 43.3969 41.0317 46.3364 26.3262 41.7972 27.6104 23.5856 9.7562 4.8989 19.8584 81.4713 10.6980 84.7500 56.1558 87.8656 27.6481 52.0121 34.4407 33.7049 4.5502
temp: 298.150 k
press: 1.00000 atm
elementType: 8 6 6 6 6 6 6 6 6 6 6 1 1 1 1 1 1 1 1 1 1 1 1 1 1 1 1 1 1 1 1 1 1
symmnumber: 1
zpe: 787067.9 jmol-1
zpe.correction: 0.299778 hartree
zpe.thermalcorrener: 0.314994 hartree
zpe.thermalcorrenthalpy: 0.315938 hartree
zpe.thermalcorrgfe: 0.257413 hartree
zpe.sumelectzpe: -468.540837 hartree
zpe.sumelectthermal: -468.525622 hartree
zpe.sumelectthermalent: -468.524677 hartree
zpe.sumelectthermalfe: -468.583202 hartree
dipole: -1.2558 1.4793 -0.4371
dipole: 1.9891
quadrupole: -76.2682 -75.4059 -71.1241
quadrupole: 4.9306 -3.5982 1.9260
quadrupole: -2.0021 -1.1398 3.1420 4.9306 -3.5982 1.9260
hfenergy: -468.8406155 hartree
pointgroup: C01 [X(C10H22O1)]
dipole: -0.4945212 0.5833575 -0.1659782 debye
polarizability: 130.2171205|0.1708284|107.0375269|-2.213421|1.1069679|100.3296007 unknown
InChI: InChI=1S/C10H22O/c1-5-10(4,11)8-6-7-9(2)3/h9,11H,5-8H2,1-4H3
charge 0 multiplicity 1
33 atoms
O  2.179528 -1.274779 1.301158
C  2.118864 -0.404166 0.088239
C  0.737787 -0.577947 -0.606871
C  -0.493874 -0.129385 0.213318
C  -1.82186 -0.449306 -0.512583
C  -3.106455 -0.094495 0.283948
C  2.403949 1.056901 0.537531
C  3.240754 -0.961546 -0.804365
C  -3.247072 1.429588 0.517123
C  -4.358189 -0.647158 -0.438978
C  2.418834 2.112651 -0.59003
H  0.629383 -1.652849 -0.854964
H  0.747917 -0.029741 -1.570526
H  -0.434621 0.956785 0.42006
H  -0.50134 -0.645172 1.198065
H  -1.838805 -1.533043 -0.752477
H  -1.845193 0.085062 -1.486532
H  -3.036849 -0.589976 1.276802
H  1.64906 1.351907 1.296203
H  3.380503 1.052712 1.059375
H  3.075977 -2.039079 -0.97853
H  3.268089 -0.449184 -1.78204
H  4.220643 -0.84108 -0.31019
H  -2.403423 1.839908 1.101055
H  -3.284314 1.967161 -0.450731
H  -4.178423 1.660899 1.06697
H  -4.463527 -0.190353 -1.442431
H  -4.29456 -1.743482 -0.572332
H  -5.280581 -0.425722 0.129805
H  3.178574 1.876143 -1.356678
H  2.658917 3.111423 -0.181819
H  1.438294 2.18742 -1.095237
H  1.511515 -0.943301 1.955263
