program: Gaussian 09
title: 000058028
version: EM64L-G09RevD.01
frameworkgroup: C1[X(C17H26N2O3)]
method: RPBEPBE
basis: SDD
operation: Freq
keyword: #p
keyword: freq=noraman
keyword: PBEPBE/SDD
title: #p freq=noraman PBEPBE/SDD
converged: NO YES NO NO
title: Mulliken charges:
elementType: O O O N N C C C C C C C C C C C C C C C C C H H H H H H H H H H H H H H H H H H H H H H H H H H
charge: -0.309732 -0.225003 -0.237672 -0.067409 -0.693952 -0.364998 -0.354062 -0.392098 -0.400048 -0.397714 -0.331237 -0.420624 -0.263044 0.178462 0.086377 0.249340 -0.285292 -0.587771 0.551563 -0.450661 -0.246778 -0.679410 0.166061 0.211037 0.217264 0.163594 0.204369 0.190406 0.190416 0.204366 0.212324 0.187871 0.173962 0.202709 0.215635 0.226685 0.221738 0.215190 0.274739 0.237503 0.220394 0.205075 0.205162 0.311876 0.307528 0.238167 0.239294 0.198394
chargesum: 0.00000
title: Mulliken charges with hydrogens summed into heavy atoms:
elementType: O O O N N C C C C C C C C C C C C C C C C C
charge: -0.309732 -0.225003 -0.237672 -0.067409 -0.074547 0.012100 0.026796 0.002677 -0.005266 0.002482 0.045434 0.021696 0.173884 0.178462 0.086377 0.249340 -0.010553 -0.350267 0.551563 -0.230267 0.163459 -0.003555
polarizability: 2.96136855e+02 1.66642341e+01 2.43888596e+02 -9.17730151e-01 -1.21114568e+00 1.30705107e+02
1716.lowfreq: -16.9175 -0.0004 0.0009 0.0011 3.9411 8.8296 10.9553 15.6878 30.6516
frequency: -11.2646 15.6299 30.5838 33.0538 61.4455 72.5502 76.6808 85.1763 94.5430 114.3717 119.4189 155.7745 164.6781 181.1270 219.8579 220.8639 233.6895 236.4556 296.1695 299.4924 301.0672 313.9134 348.6103 358.4630 381.9296 395.0484 398.1936 405.7733 444.7297 455.8865 458.9849 473.6155 550.2923 571.2150 575.8503 619.1512 631.7397 675.3179 724.8548 750.4031 753.2358 766.9754 782.8348 803.4491 813.1163 826.1510 848.6312 849.4706 856.2305 866.8916 871.1177 909.0267 919.9848 957.9248 972.5502 973.6942 992.8393 1014.9368 1026.0321 1042.3344 1055.4709 1056.4056 1071.6424 1089.8519 1106.8966 1115.3359 1123.6496 1130.8778 1131.8288 1143.0069 1151.1340 1158.9682 1184.8617 1189.4682 1222.8700 1226.8792 1258.7505 1262.1072 1262.7231 1269.6108 1271.5190 1281.7970 1287.6422 1301.1065 1330.8256 1331.7281 1340.6698 1344.1556 1350.0751 1362.4349 1366.0090 1378.3531 1395.4061 1396.7842 1405.9970 1440.1966 1450.8976 1457.6258 1460.6255 1460.9657 1465.6370 1471.6269 1473.3034 1475.4081 1480.0990 1487.6374 1490.8715 1513.8314 1568.7362 1623.4911 1630.8945 1645.2509 2806.3323 2812.5377 2830.9445 2949.3903 2967.0577 2984.6816 2984.8519 2987.7117 2993.5377 2998.4721 3006.5894 3009.2653 3018.6971 3032.5184 3042.4131 3044.0003 3046.7525 3054.2605 3077.6428 3095.6783 3111.6768 3134.1036 3153.2763 3183.5390 3564.2270 3704.6430
redmass: 2.9992 4.5281 4.7123 5.9971 4.1340 3.3541 2.5147 3.6200 2.8556 1.7146 3.8490 3.9485 4.9911 2.4597 4.0615 3.1391 2.0401 1.2811 3.5049 2.1334 4.6571 5.0550 4.5566 4.7514 1.8549 3.5501 1.1433 1.1448 3.0318 2.9956 2.7688 3.1007 2.7605 4.6404 3.1060 5.8946 5.8084 2.9449 5.6011 2.5031 3.2914 1.1681 7.4607 1.4763 1.6259 1.3602 1.6763 1.5686 2.2018 3.3581 1.3227 2.2541 6.3546 1.2984 1.5274 2.1923 2.7208 7.1070 2.5573 2.3763 1.6697 1.9643 2.1247 2.5982 1.8102 2.2040 2.3568 1.8779 1.4269 1.6435 1.3955 2.1922 1.2059 2.2521 1.7664 2.8395 1.2530 1.1478 1.1669 1.2356 1.4568 1.3966 1.1387 1.4336 1.2867 2.2130 1.4010 1.4344 1.4777 1.5459 1.4364 1.4254 1.4654 1.5700 2.9358 3.3597 1.0904 1.0390 1.0810 1.0883 1.0911 1.0776 1.0905 1.0871 1.0933 1.1051 1.0925 3.2305 7.7924 7.5746 4.9444 1.3028 1.0718 1.0709 1.0696 1.0548 1.0621 1.0611 1.0620 1.0583 1.0834 1.0366 1.0613 1.1075 1.0867 1.0960 1.1009 1.1018 1.0922 1.1030 1.1054 1.0987 1.1013 1.0902 1.0900 1.0940 1.0450 1.1040
irintensity: 0.5747 1.2985 0.8164 1.5387 0.4614 2.7924 1.0864 1.0477 1.6534 0.5728 1.4096 1.7570 1.7177 0.9954 1.5237 0.5863 1.3491 0.0169 1.5379 6.3105 8.7288 4.8477 1.9390 3.9214 4.3581 8.1416 140.8854 147.9769 2.0946 1.1349 0.1303 11.6219 6.5778 8.7636 3.1427 6.0737 0.1744 23.6831 0.5012 2.4415 9.9764 4.2561 29.7376 0.5663 4.8671 54.9830 35.0667 1.4343 7.6687 7.7295 1.7266 5.7692 14.4130 3.1182 8.5053 28.1585 98.8704 424.1797 68.3365 7.0176 45.1409 60.8593 18.3018 4.1768 16.1927 3.9945 3.6306 15.3338 4.5912 167.9271 5.9304 20.5695 2.2006 113.6745 50.9495 346.3899 3.9468 0.0932 3.3567 14.7931 34.1751 11.1802 5.8168 17.2769 7.6278 95.3123 1.0180 13.1235 1.3694 13.3189 0.5285 10.1150 9.0468 31.2729 16.8108 43.0131 6.8379 11.5295 2.7911 14.5036 11.9400 0.8182 0.8835 18.3895 3.7627 14.1903 12.6217 46.5486 133.2427 211.6017 457.9089 262.8910 47.7944 43.7869 228.0462 44.3606 39.5491 38.8183 31.4165 23.8831 12.1056 26.5925 23.8840 38.8242 74.3342 70.1420 17.9402 28.4469 6.5584 106.6113 56.7328 29.0303 29.2614 16.8658 15.6622 4.0938 100.9491 21.4051
temp: 298.150 k
press: 1.00000 atm
elementType: 8 8 8 7 7 6 6 6 6 6 6 6 6 6 6 6 6 6 6 6 6 6 1 1 1 1 1 1 1 1 1 1 1 1 1 1 1 1 1 1 1 1 1 1 1 1 1 1
symmnumber: 1
zpe: 1070315.5 jmol-1
zpe.correction: 0.407662 hartree
zpe.thermalcorrener: 0.429983 hartree
zpe.thermalcorrenthalpy: 0.430927 hartree
zpe.thermalcorrgfe: 0.354274 hartree
zpe.sumelectzpe: -996.871515 hartree
zpe.sumelectthermal: -996.849193 hartree
zpe.sumelectthermalent: -996.848249 hartree
zpe.sumelectthermalfe: -996.924902 hartree
dipole: 3.5062 3.3645 0.4010
dipole: 4.8759
quadrupole: -80.3881 -120.0515 -136.7157
quadrupole: 15.5011 -4.5157 0.6638
quadrupole: 31.9970 -7.6664 -24.3306 15.5011 -4.5157 0.6638
hfenergy: -997.2791763 hartree
pointgroup: C01 [X(C17H26N2O3)]
dipole: -1.4634891 -1.2362643 0.0988779 debye
polarizability: 297.6590536|13.2546604|242.0302814|7.5140239|1.8514785|131.041222 unknown
InChI: InChI=1S/C17H26N2O3/c1-2-21-16-13-14(18)7-8-15(16)17(20)22-12-6-11-19-9-4-3-5-10-19/h7-8,13H,2-6,9-12,18H2,1H3
charge 0 multiplicity 1
48 atoms
O  -0.011132 0.155189 -0.137339
O  -3.975825 1.748914 -0.313737
O  -1.262701 2.118346 -0.043343
N  4.938579 0.072547 -0.173064
N  -5.590994 -2.869966 -0.530778
C  6.145791 0.939301 -0.134849
C  5.124302 -1.141497 0.664275
C  7.396332 0.184972 -0.629769
C  6.344172 -1.960719 0.195588
C  7.624575 -1.096747 0.20332
C  3.718851 0.839809 0.181128
C  2.408623 0.064257 -0.07988
C  1.200276 1.001403 -0.00908
C  -1.244852 0.86628 -0.136296
C  -2.386541 -0.069468 -0.249068
C  -3.751373 0.375331 -0.327992
C  -2.156957 -1.474341 -0.275828
C  -4.807489 -0.560985 -0.421119
C  -4.544001 -1.957772 -0.44082
C  -3.193644 -2.409564 -0.368054
C  -5.363855 2.247273 -0.403506
C  -5.27285 3.770502 -0.369278
H  6.337102 1.318989 0.905812
H  5.957075 1.821693 -0.775474
H  4.213904 -1.762328 0.596962
H  5.26036 -0.86387 1.745623
H  7.250201 -0.086025 -1.693301
H  8.276372 0.854313 -0.570533
H  6.464232 -2.845122 0.850881
H  6.151749 -2.32654 -0.831593
H  8.48454 -1.670333 -0.191535
H  7.873255 -0.816462 1.24824
H  3.739893 1.177628 1.252341
H  3.719926 1.757497 -0.441091
H  2.270089 -0.743085 0.662663
H  2.461948 -0.405265 -1.079166
H  1.205414 1.749322 -0.824114
H  1.15301 1.550149 0.951704
H  -1.120178 -1.814359 -0.219645
H  -5.844854 -0.218168 -0.480117
H  -2.972155 -3.48265 -0.383825
H  -5.953879 1.857853 0.452147
H  -5.825706 1.890367 -1.347604
H  -5.406012 -3.868727 -0.545345
H  -6.556601 -2.55906 -0.583355
H  -4.670686 4.140216 -1.215954
H  -4.791647 4.106897 0.564165
H  -6.28344 4.214602 -0.429898
