program: Gaussian 09
title: 000006547
version: EM64L-G09RevD.01
frameworkgroup: C1[X(C8H12N4)]
method: RPBEPBE
basis: SDD
operation: Freq
keyword: #pfreq=noraman
keyword: PBEPBE/SDD
title: #p freq=noraman PBEPBE/SDD
converged: NO YES NO NO
title: Mulliken charges:
elementType: N N N N C C C C C C C C H H H H H H H H H H H H
charge: -0.073607 -0.073572 -0.001022 -0.001010 0.193761 0.193669 -0.691262 -0.691232 -0.691221 -0.691179 -0.186263 -0.186251 0.255101 0.237626 0.232106 0.255063 0.237608 0.232106 0.255091 0.237618 0.232103 0.255041 0.237614 0.232112
chargesum: 0.00000
title: Mulliken charges with hydrogens summed into heavy atoms:
elementType: N N N N C C C C C C C C
charge: -0.073607 -0.073572 -0.001022 -0.001010 0.193761 0.193669 0.033572 0.033546 0.033590 0.033588 -0.186263 -0.186251
polarizability: 1.40736055e+02 1.14762195e+01 9.99016605e+01 5.16540336e-03 3.96216672e-03 8.51171985e+01
1716.lowfreq: -56.2267 0.0005 0.0008 0.0008 5.5197 6.0450 12.2867 12.8070 81.6628
frequency: -55.8578 6.0443 81.6628 96.3851 132.6776 179.6517 185.4085 218.3521 222.9464 228.7605 230.6497 264.1639 279.3713 290.5879 338.3422 350.8796 411.2290 443.4874 456.6641 559.6160 566.2596 578.1250 591.4432 680.8705 766.9013 822.8990 825.0491 929.5746 938.2070 938.8316 959.1337 1005.7821 1008.9660 1125.9429 1139.8434 1144.3100 1157.0589 1226.9523 1241.7688 1368.5262 1368.9935 1386.6224 1388.2583 1452.5409 1454.6676 1455.2784 1464.1547 1466.5748 1471.8467 1472.1781 1485.0637 1487.8807 2201.6492 2201.8569 3002.8268 3003.0373 3003.4252 3003.9656 3108.3107 3109.0328 3111.7727 3112.0285 3115.2153 3115.3254 3118.7848 3119.2604
redmass: 9.5303 4.1629 7.6077 3.6518 7.5259 3.9650 3.5093 1.0847 2.1775 1.0550 3.0518 1.0302 1.3830 2.8199 2.4236 2.5477 6.2299 4.6212 5.5345 5.9190 5.1350 5.3846 8.1603 5.5133 3.0327 6.0156 2.9632 2.2203 1.5054 1.4871 2.3573 1.2881 1.2904 3.8180 1.8303 1.9460 4.2224 2.8723 3.0388 1.1717 1.1712 1.2224 1.1804 9.3258 1.0480 1.0471 1.0475 1.0473 1.0516 1.0585 1.0531 1.0575 12.6436 12.6416 1.0336 1.0336 1.0340 1.0341 1.1013 1.1012 1.1010 1.1010 1.1023 1.1023 1.1014 1.1012
irintensity: 0.0001 7.5073 11.7788 0.2696 0.0000 0.0000 2.2007 0.0008 4.8070 0.0053 0.0000 0.0000 0.5307 0.0000 1.4738 0.0000 0.0000 0.7757 5.1655 0.0000 0.0000 6.1581 5.2589 3.9746 0.0000 0.0075 12.3031 0.4735 0.0006 2.3301 0.0000 0.0000 0.0455 0.0001 0.0016 47.9995 21.3589 113.7821 0.0000 0.0353 33.5681 0.0021 25.3242 0.0003 16.5945 0.0023 0.0000 0.0068 27.9868 0.0165 34.4504 0.0000 5.9701 0.0071 0.0069 24.6709 16.4209 0.0005 0.0016 23.1490 38.6667 0.0173 1.9385 0.0554 35.1310 0.0586
temp: 298.150 k
press: 1.00000 atm
elementType: 7 7 7 7 6 6 6 6 6 6 6 6 1 1 1 1 1 1 1 1 1 1 1 1
symmnumber: 1
zpe: 494499.6 jmol-1
zpe.correction: 0.188345 hartree
zpe.thermalcorrener: 0.201974 hartree
zpe.thermalcorrenthalpy: 0.202918 hartree
zpe.thermalcorrgfe: 0.147101 hartree
zpe.sumelectzpe: -530.055397 hartree
zpe.sumelectthermal: -530.041768 hartree
zpe.sumelectthermalent: -530.040824 hartree
zpe.sumelectthermalfe: -530.096641 hartree
dipole: 0.0014 -0.0005 0.0077
dipole: 0.0079
quadrupole: -95.9534 -76.7393 -66.7086
quadrupole: -23.5531 -0.0026 -0.0019
quadrupole: -16.1530 3.0612 13.0918 -23.5531 -0.0026 -0.0019
hfenergy: -530.2437421 hartree
pointgroup: C01 [X(C8H12N4)]
dipole: 0.0005465 0.0002577 -0.0030343 debye
dipolederiv: -0.0710541 0.1245849 -0.0000209 0.3120728 -0.0726836 -0.0000133 0.0000434 -0.000108 -0.1933648 -0.0711134 0.1246897 0.0000056 0.3124092 -0.0726938 -0.0000173 -0.0000024 0.0001741 -0.1933217 -0.2611803 0.0274544 -0.0004131 0.031879 -0.2075747 0.0004158 0.0000109 0.0001037 -0.2042892 -0.2612506 0.0273896 0.000285 0.0318923 -0.2074757 -0.0002946 -0.0000172 -0.0000624 -0.2042656 0.4182803 -0.0904075 -0.000133 -0.2295718 0.1551884 0.0000104 -0.0003521 0.0001357 0.3122052 0.4182633 -0.0904168 0.0001492 -0.2298314 0.155144 0.000016 0.0003289 -0.0001011 0.3121281 -0.1586063 0.0255526 -0.0150405 0.0314433 0.0037476 0.027529 -0.0438115 -0.0077406 -0.0056053 -0.1583372 0.0253884 0.0151383 0.0312889 0.003883 -0.027546 0.0441474 0.0076347 -0.0055801 -0.1585252 0.0255075 0.0150319 0.0314622 0.0037498 -0.0275442 0.0437991 0.0076995 -0.0055867 -0.1582911 0.0253988 -0.0151241 0.0313165 0.0039105 0.0275402 -0.0441778 -0.0076695 -0.0055158 0.0538897 -0.1124669 0.0002062 -0.1052698 -0.0689986 -0.0003954 0.0001197 -0.0002123 -0.1107408 0.0539185 -0.1125008 -0.0001019 -0.1052202 -0.0690745 0.0002784 -0.0000576 0.0001037 -0.110752 0.0136536 0.1087546 -0.0047359 0.0981749 0.0365482 0.0130401 -0.0031768 0.0028971 0.076743 0.1216973 -0.0013765 -0.0177608 0.0043248 0.0184392 -0.1069546 -0.005907 -0.062337 -0.0617767 -0.0467692 -0.1074837 0.0020662 -0.138492 0.0383044 0.0208322 0.0203343 0.0038383 0.0886775 0.0135205 0.1087994 0.0049506 0.0981504 0.0365308 -0.0131879 0.0032353 -0.0029526 0.0767277 0.1217348 -0.0013497 0.0175951 0.0044235 0.0183036 0.1070535 0.0057239 0.0624222 -0.0616705 -0.0467626 -0.1074667 -0.0020516 -0.1385282 0.0383039 -0.0207875 -0.0203494 -0.0037933 0.0886493 0.0136781 0.1087877 0.0047386 0.0981832 0.0364792 -0.0130533 0.0031534 -0.0028757 0.0767406 0.1216899 -0.0014094 0.0177988 0.0042811 0.0184246 0.1069559 0.0059196 0.0623402 -0.0617733 -0.0468488 -0.1074458 -0.0020699 -0.1384503 0.0383911 -0.0208212 -0.0203359 -0.0038351 0.0886805 0.0135205 0.1088049 -0.0049163 0.0981501 0.0364413 0.0132073 -0.0032089 0.0029602 0.0767186 0.1217283 -0.0013737 -0.0176247 0.0043988 0.01832 -0.1070434 -0.0057559 -0.0624051 -0.0616757 -0.046836 -0.1074151 0.0020273 -0.1384874 0.0383912 0.02078 0.0203367 0.003783 0.0886479 unknown
polarizability: 142.4588329|-7.641141|98.1788821|-0.0055002|0.0034826|85.1171985 unknown
InChI: InChI=1S/C8H12N4/c1-7(2,5-9)11-12-8(3,4)6-10/h1-4H3
charge 0 multiplicity 1
24 atoms
N  -0.53772 0.347621 -0.00006
N  0.537338 -0.347388 -0.000192
N  -3.89743 1.092948 0.003512
N  3.896615 -1.093812 0.003003
C  -1.79069 -0.555222 0.000059
C  1.79041 0.555075 0.000105
C  -1.806697 -1.428336 1.285667
C  -1.807755 -1.427216 -1.286278
C  1.806716 1.428169 1.285754
C  1.80788 1.427191 -1.286183
C  -2.94713 0.373696 0.000939
C  2.946756 -0.373973 0.000994
H  -0.922908 -2.08727 1.275268
H  -1.779012 -0.79964 2.191627
H  -2.722624 -2.041444 1.311845
H  -0.923905 -2.086078 -1.277204
H  -1.780904 -0.797741 -2.191723
H  -2.72366 -2.040366 -1.312179
H  0.923134 2.087372 1.275339
H  1.778799 0.799443 2.191686
H  2.72286 2.040946 1.311934
H  0.924265 2.086364 -1.277073
H  1.780828 0.797786 -2.191672
H  2.72403 2.039974 -1.311967
