program: Gaussian 09
title: 000058053
version: EM64L-G09RevD.01
frameworkgroup: C1[X(C21H34N2O3)]
method: RPBEPBE
basis: SDD
operation: Freq
keyword: #p
keyword: freq=noraman
keyword: PBEPBE/SDD
title: #p freq=noraman PBEPBE/SDD
converged: NO YES NO NO
title: Mulliken charges:
elementType: O O O N N C C C C C C C C C C C C C C C C C C C C C H H H H H H H H H H H H H H H H H H H H H H H H H H H H H H H H H H
charge: -0.319295 -0.287621 -0.322230 -0.102651 -0.155783 -0.071565 -0.400029 -0.366116 -0.414843 -0.389201 -0.371667 -0.736084 -0.260421 -0.085555 0.334478 -0.298607 -0.715416 -0.656743 0.414414 -0.512928 -0.614042 0.486366 0.497832 -0.591432 -0.817684 -0.812842 0.213715 0.208838 0.188079 0.180753 0.206294 0.212124 0.195700 0.191398 0.205362 0.217530 0.194994 0.219754 0.218061 0.227407 0.232575 0.227161 0.224581 0.201829 0.264504 0.223641 0.207944 0.265746 0.220461 0.273356 0.251342 0.252973 0.249444 0.233089 0.222839 0.227119 0.230831 0.227939 0.223458 0.228825
chargesum: 0.00000
title: Mulliken charges with hydrogens summed into heavy atoms:
elementType: O O O N N C C C C C C C C C C C C C C C C C C C C C
charge: -0.319295 -0.287621 -0.322230 -0.102651 -0.155783 0.142150 -0.003111 0.020932 -0.007019 0.007560 0.040857 -0.070862 0.199314 0.139026 0.334478 0.167726 -0.018086 0.088416 0.414414 -0.259955 -0.364598 0.486366 0.497832 -0.358344 -0.136895 -0.132620
polarizability: 2.67706952e+02 1.45576663e+01 2.45745580e+02 -9.44054434e-01 6.43463439e+00 2.47967980e+02
1716.lowfreq: -19.2360 -2.0220 -0.0002 0.0004 0.0007 5.2183 6.6557 13.6544 21.9347
frequency: -17.7677 13.3745 21.8892 26.4845 42.9431 47.4329 54.8667 56.2600 61.9690 79.3591 97.1041 106.4165 114.2357 115.9587 138.4973 141.1140 165.2036 178.0422 185.2043 194.7421 209.8770 220.4306 223.2533 230.9767 241.7477 243.3288 246.0971 287.8999 300.8262 324.9565 337.4988 344.6186 367.4886 395.8409 435.9877 448.0468 464.3258 480.8518 498.3975 514.1687 521.9907 522.7534 533.2448 543.0586 575.6559 597.0506 625.3440 633.7023 695.7045 700.1029 726.4864 769.7890 792.2951 811.0793 831.2159 848.0024 852.9319 861.7855 875.1984 885.5645 885.7921 895.0061 922.0758 928.1102 942.5725 952.1082 973.7437 978.4439 984.5969 994.8912 997.6338 1017.0896 1032.1170 1045.4545 1045.6775 1046.7081 1049.3879 1081.0040 1083.6126 1086.9586 1097.0040 1110.8553 1114.3376 1122.6986 1139.7845 1151.3313 1154.6632 1157.7300 1159.1293 1173.8330 1179.5394 1186.5752 1199.9159 1232.1833 1245.9138 1262.0391 1279.3861 1284.3672 1286.1574 1288.7247 1303.1336 1308.2094 1312.9803 1335.4381 1337.0672 1344.9075 1347.0691 1356.3865 1364.4768 1369.7027 1376.9228 1382.1977 1388.0109 1390.6254 1394.8426 1396.7375 1403.4257 1431.9195 1445.8486 1452.6811 1452.8208 1459.9905 1462.5779 1464.9022 1469.0258 1469.6911 1470.6292 1472.6758 1476.1108 1480.3086 1484.6269 1485.7257 1487.5199 1487.8250 1488.9087 1489.3190 1495.4682 1604.3203 1621.1818 1631.8777 2848.6720 2896.1157 2968.8433 2973.8028 2974.7701 2974.8092 2975.6308 2978.3536 2979.7159 2985.4574 2990.9294 2992.5340 3019.3866 3021.3242 3028.3259 3031.9334 3033.4039 3043.7740 3052.0472 3052.7105 3053.7225 3054.0950 3055.1074 3070.0609 3081.0176 3083.9938 3084.5769 3084.8880 3091.5166 3110.3027 3118.7502 3144.3392 3147.2210 3149.3831
redmass: 3.3162 4.6549 3.6496 4.1592 3.9144 1.0326 3.8165 3.2113 1.0860 3.1249 3.4609 2.8988 1.9393 1.8814 3.1306 1.8145 1.9682 2.3245 2.9807 2.2402 1.3193 2.5600 3.3146 2.4734 3.4657 3.9013 2.6474 3.2869 2.9984 2.0048 3.0717 3.2785 2.6082 2.3950 3.3329 3.1439 3.2509 3.0793 4.4496 2.5804 3.4862 3.1852 4.4292 3.4006 3.9117 3.3121 2.7285 5.0117 2.0683 10.1128 3.6335 4.3048 1.2264 1.6560 1.9393 1.4755 2.3939 1.3313 2.6606 1.4814 1.4990 3.5887 2.0132 2.1822 1.5123 3.0135 1.7479 2.8981 3.4070 1.8956 2.5991 1.5071 1.9906 1.5436 2.2099 2.1350 1.5804 1.8706 2.0316 2.3767 2.3404 1.6274 1.8119 1.3330 1.9559 2.0552 1.9670 2.3592 2.1087 1.4398 1.2009 1.5479 2.6081 1.5465 1.6466 1.2392 1.2645 1.2598 1.2627 1.3340 2.7759 1.7130 1.5728 1.5036 1.5187 1.4856 1.4232 1.4333 1.5510 1.4068 1.2386 1.2543 3.7131 1.5604 1.2297 1.3087 1.3417 2.1879 1.4106 2.0875 1.0922 1.0810 1.0514 1.0717 1.0790 1.0473 1.0458 1.0714 1.0750 1.0982 1.0836 1.3038 1.0989 1.0724 1.2272 1.0823 1.0792 5.8614 6.4184 7.5414 1.0711 1.0692 1.0592 1.0738 1.0372 1.0381 1.0372 1.0600 1.0378 1.0624 1.0367 1.0697 1.0592 1.0853 1.0883 1.0896 1.0948 1.1031 1.1012 1.0977 1.0976 1.1034 1.1027 1.0993 1.0990 1.0987 1.0992 1.0987 1.1088 1.1003 1.0914 1.0960 1.0917 1.0912
irintensity: 0.1620 0.0081 0.1132 0.1120 0.5008 0.6701 4.1213 1.1934 0.7383 0.3030 2.7791 1.9426 2.0301 0.6651 1.8954 0.2183 0.6819 0.7398 2.7294 0.0998 0.2082 1.5330 0.6387 0.4906 4.2738 2.3591 1.4937 0.7374 23.2628 0.9976 8.3623 2.7268 3.2514 6.5681 3.4651 5.1737 13.8053 1.8126 1.6974 2.0322 1.3150 0.3849 0.6967 1.6643 1.4477 12.6163 1.9762 14.1835 14.9462 27.2898 18.1395 15.9325 1.4226 0.6185 1.7066 42.2093 4.7058 10.8078 2.9662 5.0616 6.3047 9.4907 0.5689 15.3892 1.3229 9.9234 20.2063 10.6219 4.6961 15.9100 131.0877 1.4099 20.0363 4.7281 108.2943 90.5866 23.3227 10.8698 224.2378 9.0646 14.9823 12.3494 12.1667 6.1714 280.6801 58.1146 76.6507 18.3828 19.4284 6.2060 1.9339 1.5672 17.3077 23.8607 8.1421 7.2446 2.5876 0.8019 14.2013 21.8662 141.1856 33.8202 36.1877 30.4786 52.5805 72.6059 2.9793 13.0907 12.2027 27.7118 22.9353 27.9170 11.2244 18.9038 15.7851 7.9175 22.6034 16.5395 40.3496 1.2338 4.8564 11.7350 20.5103 9.2438 9.2797 19.4335 5.1437 1.5626 68.7815 21.2231 5.6696 21.5023 26.1018 3.9804 22.9011 12.2228 3.4328 132.6841 88.6513 253.6111 84.3586 72.9297 32.5550 6.8571 43.3609 59.0671 31.2914 26.3318 37.7717 47.9850 39.8118 52.0938 29.5445 9.6132 41.8299 21.9267 46.7947 18.6397 26.0845 17.7742 23.7970 91.3569 23.3243 44.5632 40.8716 20.4580 34.9500 24.7233 35.1561 12.0419 22.1770 3.4548 8.6388 7.1096
temp: 298.150 k
press: 1.00000 atm
elementType: 8 8 8 7 7 6 6 6 6 6 6 6 6 6 6 6 6 6 6 6 6 6 6 6 6 6 1 1 1 1 1 1 1 1 1 1 1 1 1 1 1 1 1 1 1 1 1 1 1 1 1 1 1 1 1 1 1 1 1 1
symmnumber: 1
zpe: 1358834.7 jmol-1
zpe.correction: 0.517553 hartree
zpe.thermalcorrener: 0.546058 hartree
zpe.thermalcorrenthalpy: 0.547002 hartree
zpe.thermalcorrgfe: 0.455591 hartree
zpe.sumelectzpe: -1153.766896 hartree
zpe.sumelectthermal: -1153.738390 hartree
zpe.sumelectthermalent: -1153.737446 hartree
zpe.sumelectthermalfe: -1153.828858 hartree
dipole: 0.5288 0.5175 -1.4271
dipole: 1.6075
quadrupole: -144.6691 -149.0222 -153.6634
quadrupole: -0.7885 -4.1053 -1.3501
quadrupole: 4.4491 0.0960 -4.5452 -0.7885 -4.1053 -1.3501
hfenergy: -1154.2844487 hartree
pointgroup: C01 [X(C21H34N2O3)]
dipole: -0.2042009 0.2216275 0.556026 debye
polarizability: 264.7386702|-16.2155534|248.8274047|-1.095667|-6.8085252|247.8544372 unknown
InChI: InChI=1S/C21H34N2O3/c1-16-12-17(2)14-20(13-16)26-15-19(4)22(5)21(24)25-11-10-23-9-7-6-8-18(23)3/h12-14,18-19H,6-11,15H2,1-5H3
charge 0 multiplicity 1
60 atoms
O  -1.341788 1.362914 0.54756
O  3.222167 0.636888 0.667878
O  -0.030316 1.685399 -1.374315
N  -4.704151 -0.098057 -0.184509
N  0.778331 2.257808 0.757563
C  -5.566802 -0.965277 0.675762
C  -6.453256 -1.852668 -0.235703
C  -5.46509 0.760291 -1.127373
C  -7.281264 -1.015674 -1.237669
C  -6.348877 -0.096434 -2.058512
C  -3.63469 0.6129 0.549112
C  -6.404269 -0.18687 1.734036
C  -2.372189 0.728734 -0.317334
C  2.091841 2.724485 0.22552
C  -0.166458 1.768496 -0.117812
C  2.889804 1.576762 -0.417342
C  1.951753 3.924033 -0.738233
C  0.625891 2.211297 2.224212
C  3.907887 -0.543034 0.327087
C  4.311079 -0.877126 -0.984659
C  4.188077 -1.412009 1.411795
C  5.001551 -2.096848 -1.219045
C  4.874406 -2.623166 1.191983
C  5.27682 -2.955363 -0.13216
C  5.429341 -2.459908 -2.631993
C  5.183096 -3.56265 2.34613
H  -4.875804 -1.635763 1.225721
H  -5.788649 -2.533585 -0.80218
H  -7.116695 -2.477975 0.392648
H  -6.10635 1.506175 -0.59037
H  -4.743439 1.340767 -1.731073
H  -7.850847 -1.685152 -1.909902
H  -8.028333 -0.400417 -0.696977
H  -6.937114 0.567261 -2.721593
H  -5.69145 -0.715586 -2.69921
H  -3.376616 0.030964 1.453585
H  -3.937726 1.630466 0.893715
H  -7.141635 0.487778 1.264547
H  -6.956442 -0.894837 2.379429
H  -5.752012 0.423725 2.385339
H  -2.021812 -0.269568 -0.632518
H  -2.520819 1.349632 -1.21795
H  2.661553 3.051281 1.115665
H  3.822779 1.975167 -0.866664
H  2.285664 1.078269 -1.197442
H  1.374604 4.731631 -0.254913
H  2.949519 4.322446 -0.998909
H  1.429881 3.627634 -1.662274
H  0.739147 3.224199 2.655928
H  -0.371095 1.827371 2.476392
H  1.395388 1.547555 2.659559
H  4.096012 -0.214648 -1.829304
H  3.858988 -1.121508 2.415086
H  5.80972 -3.897567 -0.31187
H  5.953127 -3.430812 -2.65761
H  6.110619 -1.697488 -3.055086
H  4.557292 -2.528673 -3.309501
H  4.766663 -4.571067 2.16337
H  4.763128 -3.190239 3.296122
H  6.27466 -3.682261 2.483261
