program: Gaussian 09
title: 000057975
version: EM64L-G09RevD.01
frameworkgroup: C1[X(C5H9FO2S)]
method: RPBEPBE
basis: SDD
operation: Freq
keyword: #p
keyword: freq=noraman
keyword: PBEPBE/SDD
title: #p freq=noraman PBEPBE/SDD
converged: YES YES NO NO
title: Mulliken charges:
elementType: S F O O C C C C C H H H H H H H H H
charge: 0.193020 -0.241389 -0.459486 -0.195758 -0.078865 -0.392481 -0.197771 -0.164933 -0.826456 0.243549 0.234512 0.235752 0.236795 0.189810 0.369493 0.272663 0.272518 0.309028
chargesum: 0.00000
title: Mulliken charges with hydrogens summed into heavy atoms:
elementType: S F O O C C C C C
charge: 0.193020 -0.241389 -0.089994 -0.195758 0.164684 0.077783 0.228834 -0.164933 0.027752
polarizability: 1.02825922e+02 -9.51660331e+00 7.90186919e+01 -5.23848357e+00 -6.35326128e+00 5.64623734e+01
1716.lowfreq: -7.9024 -5.4144 -4.1036 0.0005 0.0017 0.0022 19.8431 70.6401 78.6596
frequency: 19.4276 70.6324 78.6247 96.2217 103.3516 135.8037 189.5687 239.8057 301.8896 314.9119 330.8060 378.2135 456.7775 500.7128 626.0082 654.2352 773.0405 813.4866 895.7486 945.6090 981.1479 989.0480 1007.5309 1049.6112 1068.5003 1111.3402 1173.5374 1217.0969 1267.5313 1284.5792 1323.5002 1339.1998 1363.4589 1381.9952 1453.9021 1456.6037 1463.1017 1476.8731 1594.0635 2994.9152 3009.2027 3013.8680 3014.9839 3074.1982 3108.3281 3136.6799 3158.3162 3472.5905
redmass: 7.7812 4.2162 2.6651 2.2726 1.2826 4.5813 4.3544 4.3238 3.5283 2.1505 4.1545 2.4103 5.2183 5.4666 4.8185 8.0676 2.9621 1.6445 3.0824 7.7650 1.1716 2.3748 1.3978 4.5816 3.0171 1.9970 1.1703 1.2302 1.2590 1.2436 1.1983 1.1348 1.2961 1.3365 1.0510 1.0913 1.0545 1.0854 9.1239 1.0834 1.0607 1.0293 1.0599 1.1017 1.1078 1.1023 1.1066 1.0651
irintensity: 2.9604 3.9443 1.4755 5.4972 1.3538 3.7148 2.4498 2.8619 36.2719 33.1133 71.8941 66.5029 3.7682 1.9915 8.0839 3.2861 16.6995 7.5376 100.7222 60.9584 5.4205 114.6948 91.6945 29.6972 29.1741 1.4225 1.1353 58.9443 9.0188 17.9151 0.4324 18.2445 80.1081 20.2544 19.6107 4.7280 15.9177 5.9844 142.9258 18.9215 2.2546 23.8672 47.6196 6.7020 33.6162 0.1126 8.1674 32.2351
temp: 298.150 k
press: 1.00000 atm
elementType: 16 9 8 8 6 6 6 6 6 1 1 1 1 1 1 1 1 1
symmnumber: 1
zpe: 358344.8 jmol-1
zpe.correction: 0.136486 hartree
zpe.thermalcorrener: 0.147878 hartree
zpe.thermalcorrenthalpy: 0.148823 hartree
zpe.thermalcorrgfe: 0.097186 hartree
zpe.sumelectzpe: -843.543051 hartree
zpe.sumelectthermal: -843.531659 hartree
zpe.sumelectthermalent: -843.530715 hartree
zpe.sumelectthermalfe: -843.582351 hartree
dipole: 3.4115 -0.6179 0.5901
dipole: 3.5168
quadrupole: -62.8275 -66.4877 -60.4378
quadrupole: -6.6650 -3.6286 -1.5030
quadrupole: 0.4235 -3.2367 2.8132 -6.6650 -3.6286 -1.5030
hfenergy: -843.6795375 hartree
pointgroup: C01 [X(C5H9F1O2S1)]
dipole: -1.3208111 -0.3525768 -0.2134649 debye
dipolederiv: -0.3264238 -0.2768186 -0.051108 -0.4120103 -0.5218872 -0.0842123 -0.0977474 -0.1140243 -0.110163 -0.7490295 0.1660699 -0.076739 0.2979693 -0.4243638 0.0871935 -0.161773 0.0963199 -0.3394719 -0.5040475 -0.0921213 -0.1457717 -0.0131427 -0.8045157 0.0180913 -0.1269125 0.0301515 -0.3884541 -0.5453875 0.1457397 0.1794295 -0.2071311 -0.9588 -0.3045297 0.0563422 -0.491819 -0.4914569 -0.0558264 -0.0287021 0.1505208 -0.0299544 0.5939382 0.007561 0.1647391 0.0165936 0.3297926 -0.2022966 0.0571259 0.0037435 -0.1334655 -0.0584749 0.0637636 0.1483627 0.1025217 0.0311325 0.7990873 -0.1839444 0.0757308 -0.1446759 0.4796777 -0.0621758 0.0413979 -0.0616633 0.4657179 0.7880849 0.1476093 -0.1669139 0.6816401 1.2049069 0.438117 -0.0246911 0.6480312 0.3473464 0.2025577 0.0560065 -0.0304244 0.000786 -0.0791271 -0.0892982 -0.072539 -0.1201897 0.0335749 0.0664937 -0.0320956 -0.0124562 -0.0153306 -0.004236 -0.0408186 -0.0516613 -0.0524532 -0.1030296 0.0594442 -0.0504432 -0.024792 -0.0787071 -0.0851594 -0.0239476 0.0040801 -0.0540211 0.0748144 0.0505096 0.029405 0.0289565 -0.0098508 0.0834607 -0.0260706 0.0077699 -0.0046977 -0.1056363 0.0327912 -0.0384739 -0.0256615 -0.0568633 -0.0810004 0.0025933 -0.0389722 -0.0451604 0.0618426 0.0216276 0.0302925 -0.0112509 0.0326538 0.0449774 -0.0358032 0.0105966 0.0130007 -0.1761312 0.3431452 0.1570399 0.1234203 0.0521705 0.4054046 0.0056739 0.075306 -0.0647847 0.2368706 0.0110676 -0.0321935 0.0297687 -0.0158807 0.0128741 0.1100441 0.0567802 0.1113816 0.0394448 -0.0800143 -0.0394612 -0.05994 -0.0182113 0.1342605 0.0020256 -0.0524871 0.0217039 0.012167 0.0882168 -0.015035 0.0134875 0.0700042 0.0580642 -0.0682074 0.061409 -0.0308907 0.0816393 unknown
polarizability: 100.2595581|12.4820664|79.8680254|-6.4345925|7.4743188|58.1794043 unknown
InChI: InChI=1S/C5H9FO2S/c1-9-5(8)4(7)2-3-6/h4,7H,2-3H2,1H3
charge 0 multiplicity 1
18 atoms
S  -1.812834 -1.363321 -0.468504
F  3.711074 -1.123104 0.275827
O  0.71365 1.878149 -0.144642
O  -1.663362 1.043072 0.844174
C  0.341518 0.497284 -0.433853
C  1.370242 -0.48326 0.189729
C  2.771769 -0.183607 -0.343571
C  -1.079714 0.223894 0.091434
C  -3.476868 -1.277665 0.412308
H  0.338831 0.38025 -1.536257
H  1.095876 -1.525935 -0.056072
H  1.361367 -0.376731 1.289709
H  3.097958 0.83546 -0.078515
H  2.84097 -0.338424 -1.437083
H  0.054336 2.244386 0.506888
H  -3.546782 -2.127369 1.105378
H  -4.269697 -1.319094 -0.347302
H  -3.510834 -0.322087 0.96075
