program: Gaussian 09
title: 000057979
version: EM64L-G09RevD.01
frameworkgroup: C1[X(C10H19NO4)]
method: RPBEPBE
basis: SDD
operation: Freq
keyword: #p
keyword: freq=noraman
keyword: PBEPBE/SDD
title: #p freq=noraman PBEPBE/SDD
converged: YES YES NO NO
title: Mulliken charges:
elementType: O O O O N C C C C C C C C C C H H H H H H H H H H H H H H H H H H H
charge: -0.420941 -0.421042 -0.247069 -0.247077 -0.317459 -0.053365 -0.050698 -0.396352 -0.397708 -0.492193 -0.493093 -0.734328 -0.735183 0.191322 0.191569 0.192413 0.192168 0.257616 0.185131 0.185926 0.257269 0.230182 0.250494 0.270157 0.270617 0.250693 0.249432 0.208722 0.210674 0.249915 0.210427 0.208515 0.371595 0.371670
chargesum: 0.00000
title: Mulliken charges with hydrogens summed into heavy atoms:
elementType: O O O O N C C C C C C C C C C
charge: -0.049346 -0.049372 -0.247069 -0.247077 -0.087277 0.139049 0.141470 0.046395 0.045487 0.028458 0.028217 -0.065501 -0.066326 0.191322 0.191569
polarizability: 1.32283166e+02 -3.58147710e-01 1.35260589e+02 1.49830503e-01 -2.75934249e+00 1.14505976e+02
1716.lowfreq: -12.7248 -8.4749 -4.4322 -0.0003 -0.0002 0.0005 10.8995 19.6253 29.1305
frequency: 9.5431 19.2996 29.0825 40.6916 57.8584 73.6051 123.3171 137.8600 174.1429 183.5374 185.5684 198.2172 212.5347 228.8376 246.6674 303.7910 314.5316 367.1564 369.9998 440.0942 475.7371 484.6779 496.8471 505.2022 522.4892 630.4907 633.4756 647.1498 654.5141 735.0942 790.2343 804.4498 857.1285 870.3535 873.5761 890.2115 936.8035 945.7554 947.7647 958.5670 1013.6022 1038.7327 1051.9786 1061.1010 1105.3892 1106.1101 1115.9587 1130.6484 1147.4345 1184.3534 1188.8479 1239.3688 1240.5496 1248.3350 1253.8340 1268.2320 1290.0361 1314.3421 1328.1039 1334.2739 1349.4463 1366.4902 1368.5293 1380.7871 1388.8206 1396.9094 1422.3428 1428.8225 1445.5521 1473.1206 1474.2263 1481.0790 1487.6905 1492.7732 1499.0504 1660.0559 1663.7024 2875.7730 2881.9483 2946.9943 2947.4505 2979.5918 2980.0612 2982.0891 2983.2439 3048.6569 3049.9060 3055.2105 3057.1471 3069.8704 3070.2267 3091.1092 3091.3373 3390.7962 3507.0253 3507.3012
redmass: 4.9466 7.3540 6.1928 9.4651 6.4584 3.0546 3.1362 2.4119 2.1713 3.8519 4.7147 1.4193 1.1021 1.6399 2.6364 3.9749 2.4313 3.2047 2.4847 2.8801 2.6323 3.2030 2.3941 2.2339 3.1696 2.0986 2.3437 1.8668 1.6762 1.2644 3.8088 3.9592 2.5481 2.3713 1.8065 1.8946 1.6799 1.7861 1.7659 1.6366 2.3919 1.9394 2.1979 1.6898 2.1968 1.7340 1.9578 3.4582 1.5394 1.3580 2.1240 1.2399 1.4276 1.3600 1.6809 1.4235 1.2442 1.3933 1.6956 1.6028 1.4566 1.4845 1.4551 1.3230 1.2407 1.3491 1.1230 1.1082 1.2181 1.0460 1.0454 1.0729 1.0596 1.0605 1.0756 7.7018 7.7120 1.0718 1.0710 1.0814 1.0817 1.0518 1.0438 1.0501 1.0570 1.0903 1.0885 1.0944 1.0942 1.0991 1.0991 1.0994 1.0995 1.0734 1.0638 1.0638
irintensity: 0.4824 0.0131 0.5192 0.3508 0.7130 0.0321 0.3690 9.8905 4.4961 2.5947 4.3497 0.0028 0.0289 0.1621 0.4858 0.3720 3.9244 0.3150 14.0964 11.9522 18.5025 30.2711 26.6206 14.6385 19.2903 105.5133 15.8166 135.8208 17.8332 80.6821 2.3708 4.5755 2.8664 19.7703 32.5078 8.0566 3.0121 13.8498 13.4218 24.1867 81.5586 21.3166 460.3564 85.7230 9.3128 6.1010 4.7833 53.5832 0.5692 6.2453 7.6867 6.4644 10.6700 0.7819 0.3755 6.4447 1.6558 0.6892 12.3129 69.9195 0.0686 84.5614 1.9595 7.7750 31.3878 10.5936 0.1200 49.5983 17.6863 14.1114 17.8697 4.7400 6.1011 8.7270 24.4505 3.4661 326.5362 33.9028 186.3155 7.3362 72.4513 16.4415 46.6161 49.4406 9.8406 0.6677 11.8124 7.9781 7.8040 33.4854 47.9495 18.8439 29.2369 2.8785 8.4524 30.4651
temp: 298.150 k
press: 1.00000 atm
elementType: 8 8 8 8 7 6 6 6 6 6 6 6 6 6 6 1 1 1 1 1 1 1 1 1 1 1 1 1 1 1 1 1 1 1
symmnumber: 1
zpe: 749659.2 jmol-1
zpe.correction: 0.285530 hartree
zpe.thermalcorrener: 0.303397 hartree
zpe.thermalcorrenthalpy: 0.304341 hartree
zpe.thermalcorrgfe: 0.236034 hartree
zpe.sumelectzpe: -746.906915 hartree
zpe.sumelectthermal: -746.889048 hartree
zpe.sumelectthermalent: -746.888104 hartree
zpe.sumelectthermalfe: -746.956410 hartree
dipole: -0.0334 -1.0795 -2.4012
dipole: 2.6329
quadrupole: -89.9492 -79.0024 -98.2207
quadrupole: 0.0339 -0.1710 4.8730
quadrupole: -0.8918 10.0550 -9.1633 0.0339 -0.1710 4.8730
hfenergy: -747.1924448 hartree
pointgroup: C01 [X(C10H19N1O4)]
dipole: -0.0161738 -0.4182472 -0.9475478 debye
polarizability: 132.2680934|-0.28219|135.3087693|0.1970769|-2.6291413|114.4728681 unknown
InChI: InChI=1S/C10H19NO4/c1-7(3-9(12)13)5-11-6-8(2)4-10(14)15/h7-8,11-12,14H,3-6H2,1-2H3
charge 0 multiplicity 1
34 atoms
O  -2.925561 2.558508 -0.483518
O  2.966249 2.466551 -0.40832
O  -2.558904 1.185427 1.344271
O  2.598013 1.060038 1.393498
N  -0.031878 -1.481588 -0.407526
C  -2.520242 -1.213542 -0.477456
C  2.464376 -1.296315 -0.475036
C  -1.285057 -1.594495 0.378181
C  1.216974 -1.647486 0.375778
C  -2.444404 0.254308 -0.967758
C  2.441195 0.182086 -0.937075
C  -3.837098 -1.538467 0.264713
C  3.769677 -1.684486 0.256931
C  -2.641272 1.309964 0.100901
C  2.667644 1.210421 0.152281
H  -2.488419 -1.836503 -1.398811
H  2.407729 -1.89988 -1.407992
H  -1.215499 -0.907918 1.2407
H  -1.442904 -2.622276 0.788347
H  1.339621 -2.685403 0.771983
H  1.170693 -0.971558 1.248273
H  -0.046339 -2.132439 -1.208802
H  -3.173223 0.449739 -1.77484
H  -1.434559 0.417445 -1.398203
H  1.440856 0.388473 -1.37072
H  3.181319 0.368085 -1.736366
H  -3.893766 -0.989961 1.220751
H  -3.904455 -2.619971 0.484564
H  -4.717343 -1.262241 -0.345333
H  3.847847 -1.160773 1.225287
H  4.658305 -1.425652 -0.34863
H  3.799029 -2.772546 0.451421
H  -3.01203 3.238184 0.2398
H  3.073624 3.12837 0.328605
