program: Gaussian 09
title: 000057995
version: EM64L-G09RevD.01
frameworkgroup: C1[X(C11H8ClF6NO2)]
method: RPBEPBE
basis: SDD
operation: Freq
keyword: #p
keyword: freq=noraman
keyword: PBEPBE/SDD
title: #p freq=noraman PBEPBE/SDD
converged: YES YES NO NO
title: Mulliken charges:
elementType: Cl F F F F F F O O N C C C C C C C C C C C H H H H H H H H
charge: -0.043844 -0.156908 -0.147906 -0.119443 -0.154854 -0.155787 -0.123164 -0.404534 -0.400638 -0.195179 0.004015 -0.589632 0.363887 0.381806 0.218123 0.351842 -0.283470 -0.368880 -0.121391 -0.226655 -0.219106 0.276111 0.289579 0.382197 0.302422 0.247557 0.242317 0.265980 0.385556
chargesum: 0.00000
title: Mulliken charges with hydrogens summed into heavy atoms:
elementType: Cl F F F F F F O O N C C C C C C C C C C C
charge: -0.043844 -0.156908 -0.147906 -0.119443 -0.154854 -0.155787 -0.123164 -0.022337 -0.015082 -0.195179 0.004015 -0.023942 0.363887 0.381806 0.218123 0.351842 0.018953 -0.121323 -0.121391 0.015661 0.046873
polarizability: 1.96830897e+02 -2.70923188e+00 1.54650352e+02 -2.09571915e+01 1.43658623e+01 9.61979871e+01
1716.lowfreq: -8.1561 -3.9444 0.0010 0.0016 0.0024 6.2548 10.8980 16.3241 28.6976
frequency: 8.6292 15.0394 28.6901 49.5903 71.7488 88.1176 131.9175 141.1334 148.8995 185.7163 202.0170 216.3040 219.4720 253.8932 268.6881 275.3868 290.6454 297.3781 315.3024 331.8119 355.9698 389.7641 404.5678 417.2006 430.5627 457.4197 462.6426 482.0129 490.4851 526.6334 550.6917 587.5923 621.6621 624.6137 659.7757 668.5821 690.2011 718.3407 784.4479 792.9709 808.8523 839.9752 899.1177 908.6796 933.3439 957.4193 982.3313 983.8710 985.6374 1010.8374 1037.1325 1050.7538 1066.1565 1083.2396 1090.6664 1099.0409 1113.7483 1157.7309 1175.9993 1190.2607 1250.3818 1286.2821 1297.1878 1311.2334 1340.0497 1377.7442 1420.5255 1452.3864 1469.5132 1502.0348 1566.3552 1595.7077 1602.5334 2869.8900 3019.9739 3102.0231 3144.9474 3162.3842 3179.8783 3210.0886 3551.0392
redmass: 13.9935 13.1431 8.9222 11.1366 10.8562 8.3544 10.9355 7.0686 9.9082 5.3038 8.9275 6.3043 8.6999 10.2146 7.7435 9.6578 11.5073 9.4975 9.1067 5.2702 3.5436 3.6291 4.4336 2.6175 2.7303 14.3851 9.7019 5.5051 6.3546 7.4079 11.9410 5.4615 8.6919 7.0046 6.7653 7.2366 2.6938 4.1570 6.6415 1.5296 1.1333 4.0911 1.4591 1.5845 3.0469 7.6099 1.4742 4.5056 9.9158 4.4825 6.4540 9.0843 6.1281 2.3995 5.9879 1.6618 4.4473 4.9477 6.0659 1.1283 2.3052 1.6776 1.3005 1.3524 1.4223 8.5377 2.9212 1.2992 1.7066 1.2384 5.9266 5.6470 6.4310 1.0687 1.0642 1.0972 1.0871 1.0933 1.0985 1.0932 1.0677
irintensity: 0.6125 0.3202 0.1208 0.7317 0.2417 0.6312 1.1646 2.5384 0.7333 0.1455 6.2308 3.5626 0.1861 0.3293 1.8626 2.5894 4.7283 1.5302 1.9298 6.9194 6.0077 20.5603 21.1040 47.5314 4.2641 9.1727 16.9298 14.1619 20.4245 1.6631 7.5890 22.1194 25.6514 40.1223 0.7502 11.7072 37.5643 13.5639 37.4287 41.6610 61.2043 48.6788 24.5709 28.5621 69.8678 72.9199 0.2843 4.3352 35.2738 203.4563 61.6434 208.8583 49.2804 38.6436 131.2048 5.5606 12.1346 158.0414 369.5504 4.8938 75.1800 14.5127 30.7844 60.5250 30.4363 1.0792 39.5496 2.3162 16.1040 193.7074 36.9317 30.9151 7.3256 856.0827 1.7146 0.4805 5.3287 7.8948 4.6911 4.1809 76.9539
temp: 298.150 k
press: 1.00000 atm
elementType: 17 9 9 9 9 9 9 8 8 7 6 6 6 6 6 6 6 6 6 6 6 1 1 1 1 1 1 1 1
symmnumber: 1
zpe: 470990.5 jmol-1
zpe.correction: 0.179391 hartree
zpe.thermalcorrener: 0.199412 hartree
zpe.thermalcorrenthalpy: 0.200356 hartree
zpe.thermalcorrgfe: 0.127536 hartree
zpe.sumelectzpe: -1686.666350 hartree
zpe.sumelectthermal: -1686.646328 hartree
zpe.sumelectthermalent: -1686.645384 hartree
zpe.sumelectthermalfe: -1686.718204 hartree
dipole: -4.3317 1.7396 -2.7064
dipole: 5.3958
quadrupole: -145.9264 -112.6965 -127.2339
quadrupole: -4.5390 0.0021 6.1480
quadrupole: -17.3075 15.9224 1.3851 -4.5390 0.0021 6.1480
hfenergy: -1686.8457405 hartree
pointgroup: C01 [X(C11H8Cl1F6N1O2)]
dipole: 1.8356724 -1.0431802 0.2205829 debye
polarizability: 194.308281|27.787615|96.5553368|1.3389817|-0.8251097|156.8156185 unknown
InChI: InChI=1S/C11H8ClF6NO2/c12-7-3-1-2-6(4-7)8(19-21)5-9(20,10(13,14)15)11(16,17)18/h1-4,20-21H,5H2
charge 0 multiplicity 1
29 atoms
Cl 5.308518 1.147419 -1.449388
F  -2.915315 -0.195984 2.295722
F  -3.185638 -2.148657 1.180721
F  -4.424307 -0.349003 0.609374
F  -0.986134 1.52222 -1.166817
F  -1.569285 1.879714 0.992953
F  -3.164412 1.761054 -0.612409
O  -2.395414 -0.955524 -1.251792
O  1.195134 -1.395332 -2.602749
N  0.142092 -1.326938 -1.618218
C  -2.02262 -0.360328 -0.002413
C  -0.662382 -0.878329 0.579684
C  -3.150456 -0.748075 1.00861
C  -1.957528 1.199793 -0.19019
C  0.5056 -0.90336 -0.418282
C  1.861844 -0.520289 0.047911
C  2.832738 0.038856 -0.832733
C  2.200351 -0.700198 1.420854
C  4.084868 0.411666 -0.318588
C  3.473476 -0.335679 1.901478
C  4.433738 0.233123 1.03423
H  -0.396368 -0.258114 1.449404
H  -0.839719 -1.907457 0.942958
H  -1.514197 -1.240453 -1.702213
H  2.603662 0.185959 -1.888202
H  1.481431 -1.145589 2.115562
H  3.724375 -0.489325 2.955652
H  5.421298 0.528703 1.39932
H  0.743652 -1.796073 -3.390738
