program: Gaussian 09
title: 000058003
version: EM64L-G09RevD.01
frameworkgroup: C1[X(C14H27NO)]
method: RPBEPBE
basis: SDD
operation: Freq
keyword: #p
keyword: freq=noraman
keyword: PBEPBE/SDD
title: #p freq=noraman PBEPBE/SDD
converged: NO YES NO NO
title: Mulliken charges:
elementType: O N C C C C C C C C C C C C C C H H H H H H H H H H H H H H H H H H H H H H H H H H H
charge: -0.280755 -0.410759 0.056043 -0.485404 -0.471316 -0.023332 -0.480822 -0.446732 -0.432004 -0.366678 -0.355233 0.240827 -0.515007 -0.698086 -0.348068 -0.683719 0.192347 0.176917 0.221297 0.203359 0.200919 0.257843 0.204622 0.214787 0.243665 0.197109 0.190715 0.191023 0.198389 0.187292 0.295256 0.195358 0.195313 0.195531 0.222802 0.210393 0.209015 0.216489 0.201482 0.243036 0.204855 0.209791 0.221441
chargesum: 0.00000
title: Mulliken charges with hydrogens summed into heavy atoms:
elementType: O N C C C C C C C C C C C C C C
charge: -0.280755 -0.115503 0.248390 -0.087191 -0.067038 0.234510 -0.061413 -0.005959 -0.050265 0.019003 0.035438 0.240827 -0.096674 -0.062189 0.096451 -0.047632
polarizability: 2.01127503e+02 4.99419828e-01 1.45417528e+02 4.58085050e+00 5.83136926e-01 1.34023492e+02
1716.lowfreq: -30.2829 -8.6109 -7.4168 -0.0009 -0.0005 0.0008 19.2545 22.3090 31.0967
frequency: 19.1092 22.2436 30.3213 45.2299 59.2970 75.2519 80.0055 101.6784 130.1040 138.8506 187.8382 217.7819 222.8940 228.4088 236.4219 255.1344 288.0726 295.7838 347.5394 380.6629 403.2644 427.8512 452.8924 472.6110 516.4485 527.4140 590.3757 659.3404 712.4139 722.2196 747.3716 761.6448 777.0574 805.3888 835.3339 868.6575 881.5382 892.2395 897.3149 911.9890 926.7614 943.4003 953.7161 988.5880 1018.9675 1035.6697 1048.3859 1056.1564 1067.5090 1074.5380 1083.9237 1092.1799 1100.1108 1106.1867 1113.1506 1150.7070 1158.3831 1185.8930 1201.1496 1205.5537 1235.7666 1244.8911 1248.4846 1262.4788 1276.3575 1277.4812 1286.5843 1292.0484 1293.0960 1309.5127 1315.9467 1325.7934 1333.5963 1338.7757 1343.6121 1348.2694 1353.5800 1360.6945 1367.9163 1389.0703 1390.8632 1448.3393 1455.6548 1456.8080 1462.4031 1465.1197 1467.2878 1469.9149 1476.2413 1476.3221 1476.7805 1478.4100 1482.7772 1486.6761 1487.3005 1608.0425 2926.8055 2941.5092 2945.6597 2954.7830 2962.8658 2966.7743 2969.8782 2971.0840 2971.9042 2979.6248 2981.2952 2987.6466 2991.2018 3004.1345 3021.3858 3023.3947 3023.7408 3030.8487 3032.4575 3040.8902 3047.8218 3057.4666 3067.2074 3070.3284 3073.2938 3075.6958 3549.7359
redmass: 3.2964 3.2504 3.8137 1.8957 2.4639 1.9026 3.4941 2.7826 2.6608 2.8379 3.0017 2.0839 3.2849 1.2068 1.1634 2.6437 3.2129 3.0388 2.6608 2.4225 2.0895 2.4986 2.4602 2.8540 1.9705 1.6861 2.8749 2.4114 4.3443 1.1177 1.1949 1.4754 1.4661 1.8274 2.7693 1.3529 2.1934 1.9029 1.6140 1.7904 1.5109 2.1011 2.5327 2.2468 2.7222 1.5649 2.0691 2.4700 1.8460 2.3047 1.5577 1.5336 1.8708 2.1563 1.6864 1.9072 2.3905 1.4798 1.5891 1.5755 1.3420 1.3352 1.2785 1.2708 1.2353 1.2322 1.0840 1.2308 1.3198 1.3770 1.4700 1.3908 1.5418 1.4123 1.4835 1.5824 1.5817 1.4495 1.4130 1.2170 1.2159 1.1012 1.1055 1.2201 1.3746 1.0947 1.1159 1.0852 1.0811 1.0501 1.0433 1.0461 1.1715 1.0819 1.0918 6.3866 1.0787 1.0656 1.0638 1.0592 1.0621 1.0597 1.0514 1.0363 1.0431 1.0645 1.0629 1.0968 1.0642 1.1013 1.0906 1.0931 1.0970 1.0944 1.1022 1.1016 1.1001 1.0983 1.1007 1.0992 1.0987 1.1021 1.0772
irintensity: 1.9306 2.3686 4.1859 0.1429 0.1159 0.3980 0.1459 0.5584 2.7108 1.8286 1.3020 3.2866 7.9639 0.4595 0.9243 0.0667 4.4507 0.4742 2.5395 0.2311 0.4191 1.8236 2.2179 3.2419 25.1818 52.0305 4.4269 4.2145 3.6307 7.7210 8.3214 0.8229 0.7673 1.0701 0.3739 2.0735 7.1718 4.9429 3.0714 14.0831 5.0190 10.4288 6.3827 1.9995 3.2774 0.3496 0.4184 3.1156 5.9335 3.6267 6.2340 4.2918 1.9613 10.1960 5.2105 6.3240 4.6346 1.4825 12.1867 19.5681 3.7597 3.2712 6.6039 9.7675 0.4724 13.7729 1.0984 4.4385 3.6716 9.0360 0.4921 6.0186 6.6714 0.5597 1.7794 11.6051 6.6204 2.5149 5.5415 11.0136 9.9034 10.4457 26.9232 110.4687 147.7918 19.1350 26.8063 13.2802 7.3224 2.5705 11.2122 12.1327 57.3643 14.4247 24.9596 161.7409 1.1169 21.2323 21.5225 6.4119 22.8539 118.7516 17.6845 38.0947 46.3641 19.4681 28.3587 3.7024 28.0804 1.4140 33.2374 15.7834 22.8610 58.2717 94.4713 65.7836 0.0671 35.8578 90.2241 54.6106 50.0529 77.5667 15.3251
temp: 298.150 k
press: 1.00000 atm
elementType: 8 7 6 6 6 6 6 6 6 6 6 6 6 6 6 6 1 1 1 1 1 1 1 1 1 1 1 1 1 1 1 1 1 1 1 1 1 1 1 1 1 1 1
symmnumber: 1
zpe: 1018017.6 jmol-1
zpe.correction: 0.387742 hartree
zpe.thermalcorrener: 0.406832 hartree
zpe.thermalcorrenthalpy: 0.407776 hartree
zpe.thermalcorrgfe: 0.337368 hartree
zpe.sumelectzpe: -678.380257 hartree
zpe.sumelectthermal: -678.361168 hartree
zpe.sumelectthermalent: -678.360224 hartree
zpe.sumelectthermalfe: -678.430632 hartree
dipole: 2.8830 2.5022 1.0386
dipole: 3.9562
quadrupole: -111.9500 -102.7418 -100.8317
quadrupole: -12.3118 -2.6663 -1.4990
quadrupole: -6.7755 2.4327 4.3428 -12.3118 -2.6663 -1.4990
hfenergy: -678.7679996 hartree
pointgroup: C01 [X(C14H27N1O1)]
dipole: -1.1322911 -0.9039261 0.568802 debye
polarizability: 200.939736|-0.6948572|145.0080089|-5.7781162|-2.1657222|134.6207775 unknown
InChI: InChI=1S/C14H27NO/c1-3-5-7-12-8-10-13(11-9-12)15-14(16)6-4-2/h12-13,15H,3-11H2,1-2H3
charge 0 multiplicity 1
43 atoms
O  3.518169 1.251034 -0.722623
N  1.683361 0.199733 0.236876
C  -1.997878 0.647621 -0.323461
C  -1.337293 0.304473 1.037993
C  -0.910885 0.743934 -1.426293
C  0.863908 1.433284 0.301175
C  -0.209048 1.301586 1.40705
C  0.202413 1.753063 -1.066922
C  -3.105783 -0.361766 -0.718583
C  -4.336388 -0.380324 0.217003
C  -5.460712 -1.315229 -0.286236
C  2.96677 0.193386 -0.280732
C  3.681299 -1.163702 -0.287404
C  -6.689538 -1.33917 0.648097
C  5.121118 -1.056821 0.271891
C  5.916109 -2.368226 0.106158
H  -2.468044 1.652432 -0.223886
H  -0.942022 -0.734693 0.986991
H  -2.093147 0.302392 1.845775
H  -1.379516 1.031094 -2.38813
H  -0.46278 -0.260094 -1.582802
H  1.565372 2.252578 0.546586
H  -0.658201 2.302506 1.560569
H  0.268522 1.014379 2.364215
H  0.986373 1.776935 -1.845058
H  -0.228097 2.773765 -1.00885
H  -2.666234 -1.381314 -0.769317
H  -3.448488 -0.122977 -1.747686
H  -4.038334 -0.698383 1.236581
H  -4.737084 0.650704 0.315739
H  1.279686 -0.675046 0.575567
H  -5.057404 -2.342903 -0.395811
H  -5.772139 -0.994836 -1.301575
H  3.105424 -1.926844 0.273604
H  3.736535 -1.508369 -1.339827
H  -7.127917 -0.328581 0.752098
H  -6.411617 -1.688968 1.660445
H  -7.478472 -2.011525 0.263585
H  5.078179 -0.773458 1.341983
H  5.62841 -0.226803 -0.252758
H  5.425709 -3.209219 0.632766
H  6.003936 -2.645683 -0.961571
H  6.93893 -2.267361 0.512778
