program: Gaussian 09
title: 000057949
version: EM64L-G09RevD.01
frameworkgroup: C1[X(C13H19ClN2OS)]
method: RPBEPBE
basis: SDD
operation: Freq
keyword: #p
keyword: freq=noraman
keyword: PBEPBE/SDD
title: #p freq=noraman PBEPBE/SDD
converged: YES YES NO NO
title: Mulliken charges:
elementType: Cl S O N N C C C C C C C C C C C C C H H H H H H H H H H H H H H H H H H H
charge: -0.057942 0.133099 -0.243200 -0.090053 -0.462144 -0.302256 -0.644159 0.433108 -0.769645 0.376819 -0.612335 -0.615044 0.244683 -0.298750 -0.405655 -0.813227 -0.247226 -0.225821 0.225478 0.194532 0.259723 0.277636 0.284250 0.291537 0.220077 0.192193 0.227511 0.224858 0.191490 0.228913 0.325337 0.236744 0.295485 0.211595 0.220728 0.257542 0.234117
chargesum: 0.00000
title: Mulliken charges with hydrogens summed into heavy atoms:
elementType: Cl S O N N C C C C C C C C C C C C C
charge: -0.057942 0.133099 -0.243200 -0.090053 -0.136806 0.117754 -0.106800 0.433108 -0.193859 0.376819 0.027447 0.030217 0.244683 -0.298750 -0.168911 -0.085418 0.010317 0.008296
polarizability: 2.09012766e+02 -2.03778040e+01 1.83421788e+02 1.03881201e+01 1.31571063e+01 1.66555454e+02
1716.lowfreq: -4.0493 0.0015 0.0017 0.0019 5.0060 7.7389 15.1412 17.9263 20.3675
frequency: 14.3930 17.7689 20.0172 52.8890 65.2459 78.7437 88.9066 94.7477 126.6727 136.4564 168.1824 186.0800 206.8138 218.2430 226.3441 236.3859 247.2003 263.0499 300.7710 310.6528 345.3020 368.5324 392.9165 422.8363 436.9175 456.4576 476.2508 511.8609 521.4206 562.1869 577.6763 676.3025 694.3654 711.4744 717.7823 733.4230 773.2555 787.3013 814.3028 818.9559 864.1106 888.2520 894.1338 939.6462 970.0119 995.1348 995.8813 1021.9895 1032.8153 1050.9662 1068.9714 1083.5292 1089.4272 1117.8777 1138.3270 1147.1540 1158.2211 1180.4320 1199.9378 1224.0024 1239.5942 1246.9053 1260.7076 1266.9173 1281.5257 1301.5154 1365.0622 1369.2323 1398.0876 1411.3438 1419.1773 1419.9461 1442.2388 1451.1147 1451.8592 1462.8845 1465.4117 1466.8767 1475.5372 1478.6622 1480.4849 1485.8996 1498.4634 1572.8161 1606.2332 1623.9363 2855.4956 2856.7113 2873.2865 2976.5504 3020.2257 3022.5200 3029.7650 3033.1531 3034.5275 3058.6148 3080.0723 3084.6588 3090.6744 3103.3338 3106.2866 3134.3561 3155.9615 3178.0822 3362.5688
redmass: 4.1940 3.0032 4.9550 5.0222 6.0141 4.0632 2.6477 3.8604 2.6912 6.2804 1.5773 2.3423 2.5355 1.1256 2.0429 4.1367 1.9262 2.9965 5.0373 3.4681 2.5564 7.8932 5.2722 3.2012 2.4916 4.4272 5.1349 3.8339 3.6950 5.5547 3.3005 4.4083 5.3610 4.7703 1.2897 5.0391 1.2805 1.1534 4.1864 5.1619 4.7886 2.1835 1.3336 5.7803 1.3412 1.5723 1.3948 2.5047 1.5576 1.5356 2.6868 1.7958 1.3090 1.2950 2.5474 1.5714 1.2479 1.3772 2.3310 1.5772 1.7476 1.4660 1.6752 1.9608 2.0013 1.2573 7.9809 1.3494 1.2317 1.0918 1.1735 2.0434 1.1605 1.1102 1.0968 1.0541 2.8878 1.0607 1.0570 1.1779 1.0849 1.0547 1.8983 5.6373 7.1350 6.7207 1.0587 1.0640 1.0603 1.0371 1.0616 1.0732 1.0711 1.0596 1.0850 1.0960 1.1012 1.1006 1.1001 1.1054 1.1067 1.0876 1.0928 1.0982 1.0763
irintensity: 0.1141 0.3947 0.0707 1.1959 0.4302 2.2854 4.7315 0.9003 5.6572 3.9484 2.4813 4.9009 0.2771 1.0051 4.2773 1.1654 1.1124 1.1812 5.2798 1.0333 10.7500 7.8709 6.2991 3.2415 0.7572 6.1819 8.2268 0.2401 0.7345 5.6728 2.6205 2.3768 30.3516 3.5886 73.7823 30.3803 60.5898 4.5693 19.6962 28.9253 9.8363 9.8911 0.1731 6.4265 0.4321 7.7606 1.7492 29.2660 19.4173 6.9754 20.3647 12.0579 4.4170 21.3916 9.9663 8.8088 10.1041 7.9969 15.5951 6.4098 6.1803 8.6777 7.4611 3.4027 21.4080 4.4700 35.6951 1.7389 26.0092 36.9431 4.0235 22.0995 4.0795 38.7009 6.3586 20.9882 35.0316 3.9588 12.9483 38.3938 15.5477 13.1565 403.0460 21.4170 20.5767 144.8200 74.1341 46.8834 200.0921 24.2829 4.9946 40.2963 53.6158 5.6588 15.5892 15.2824 19.9160 53.0072 17.4523 14.8403 9.5417 6.5818 15.0796 8.8922 160.7362
temp: 298.150 k
press: 1.00000 atm
elementType: 17 16 8 7 7 6 6 6 6 6 6 6 6 6 6 6 6 6 1 1 1 1 1 1 1 1 1 1 1 1 1 1 1 1 1 1 1
symmnumber: 1
zpe: 783070.6 jmol-1
zpe.correction: 0.298256 hartree
zpe.thermalcorrener: 0.318731 hartree
zpe.thermalcorrenthalpy: 0.319675 hartree
zpe.thermalcorrgfe: 0.245549 hartree
zpe.sumelectzpe: -1548.246466 hartree
zpe.sumelectthermal: -1548.225990 hartree
zpe.sumelectthermalent: -1548.225046 hartree
zpe.sumelectthermalfe: -1548.299173 hartree
dipole: 1.8575 2.8608 -1.7442
dipole: 3.8310
quadrupole: -113.2886 -118.3710 -130.7124
quadrupole: -5.2800 2.3475 0.5519
quadrupole: 7.5021 2.4197 -9.9217 -5.2800 2.3475 0.5519
hfenergy: -1548.5447215 hartree
pointgroup: C01 [X(C13H19Cl1N2O1S1)]
dipole: -0.766066 0.4625917 -1.2128179 debye
polarizability: 207.6264744|11.4491668|172.0774099|-22.5435184|12.6821408|179.286124 unknown
InChI: InChI=1S/C13H19ClN2OS/c1-10-5-4-6-11(14)13(10)15-12(17)9-18-8-7-16(2)3/h4-6,15H,7-9H2,1-3H3
charge 0 multiplicity 1
37 atoms
Cl 1.890224 2.544278 1.570633
S  -2.138978 0.135754 2.339025
O  1.129373 -2.255398 1.714492
N  -4.661396 -0.22677 -0.957509
N  0.571913 -0.099241 0.948001
C  -3.99225 0.342207 0.235893
C  -2.935555 -0.630255 0.789185
C  1.685815 0.164184 0.094764
C  -0.835434 -1.191758 2.666305
C  2.070463 -0.723778 -0.957343
C  -3.833179 -0.161765 -2.179791
C  -6.010715 0.335026 -1.178144
C  0.376629 -1.238281 1.716862
C  2.405292 1.37793 0.255832
C  3.189439 -0.375625 -1.755776
C  1.288581 -1.985353 -1.256091
C  3.500261 1.727911 -0.549184
C  3.902272 0.825709 -1.559232
H  -4.760956 0.508806 1.013346
H  -3.519182 1.335286 0.024985
H  -2.127385 -0.819439 0.062085
H  -3.408603 -1.583517 1.074453
H  -1.313017 -2.184878 2.662258
H  -0.467871 -0.999273 3.689653
H  -2.866567 -0.670228 -2.02131
H  -3.622849 0.88727 -2.510486
H  -4.351924 -0.683609 -3.003281
H  -6.497853 -0.196144 -2.015478
H  -6.005315 1.427535 -1.422238
H  -6.629982 0.186647 -0.276025
H  -0.060027 0.68525 1.175708
H  3.490797 -1.058876 -2.557538
H  1.482798 -2.755923 -0.488796
H  0.198604 -1.793457 -1.241435
H  1.558196 -2.384982 -2.248028
H  4.027554 2.671279 -0.383715
H  4.759526 1.070878 -2.194482
