program: Gaussian 09
title: 000057955
version: EM64L-G09RevD.01
frameworkgroup: C1[X(C20H27N3O2)]
method: RPBEPBE
basis: SDD
operation: Freq
keyword: #p
keyword: freq=noraman
keyword: PBEPBE/SDD
title: #p freq=noraman PBEPBE/SDD
converged: YES YES NO NO
title: Mulliken charges:
elementType: O O N N N C C C C C C C C C C C C C C C C C C C C H H H H H H H H H H H H H H H H H H H H H H H H H H H
charge: -0.279138 -0.261639 -0.094080 -0.265085 -0.696590 -0.392680 -0.407527 -0.329987 -0.332170 0.269652 0.081616 -0.675581 -0.683652 0.322628 0.265566 -0.314415 -0.416029 -0.271717 -0.310200 -0.350873 -0.212269 -0.379153 -0.359932 0.326139 -0.538000 0.216378 0.254276 0.255430 0.229673 0.210870 0.186160 0.199640 0.186690 0.209019 0.223650 0.205086 0.248368 0.217712 0.199652 0.246533 0.217196 0.226910 0.255066 0.269837 0.222002 0.302984 0.338045 0.240000 0.251979 0.246316 0.223642 0.222002
chargesum: 0.00000
title: Mulliken charges with hydrogens summed into heavy atoms:
elementType: O O N N N C C C C C C C C C C C C C C C C C C C C
charge: -0.279138 -0.261639 -0.094080 -0.265085 -0.055561 0.077974 0.077576 0.067042 0.054160 0.269652 0.081616 -0.037825 -0.017919 0.322628 0.265566 -0.067883 -0.198832 -0.044807 -0.055134 -0.081035 0.009732 -0.139153 -0.107953 0.326139 0.153960
polarizability: 3.07838887e+02 5.20066816e+00 2.59847784e+02 -1.08271344e+01 8.59471072e+00 1.93453046e+02
1716.lowfreq: -20.2862 -8.0542 -2.4238 -0.0010 -0.0006 -0.0001 6.2135 16.9018 25.7395
frequency: -19.5428 15.5236 25.5394 36.5151 45.3914 50.5866 52.7174 60.2519 90.2756 99.4033 104.5438 122.3769 141.7715 147.1107 173.5107 192.7510 224.7856 229.0498 246.9072 250.3784 263.2573 276.4607 291.1490 306.7500 308.9686 345.5052 371.5664 386.0725 388.9806 416.6993 426.3231 446.5593 455.1556 468.2635 473.4960 478.2730 502.7854 510.3822 538.9034 563.8764 591.5525 608.9355 628.9868 664.8194 694.5963 734.9916 747.8153 750.5198 756.7110 766.8822 777.7600 794.9428 801.8268 812.2837 819.8501 844.9709 848.9799 875.6313 917.4605 934.5849 945.9101 967.2990 977.2962 979.8114 985.7003 988.3765 1002.1429 1007.1008 1041.1317 1044.2323 1064.2736 1074.1618 1078.1777 1085.6754 1112.6273 1112.8277 1117.4311 1126.6719 1140.0571 1156.4424 1170.0834 1175.6254 1184.6101 1209.3334 1234.8112 1235.5240 1266.0124 1279.4138 1286.1771 1289.5686 1301.6034 1304.5196 1320.2479 1326.9917 1353.2612 1360.1067 1366.2266 1373.9029 1379.9832 1384.6805 1386.5822 1391.7938 1422.0254 1436.1235 1440.2430 1450.7061 1462.2309 1464.2027 1467.9827 1470.0370 1473.2461 1478.5598 1486.3291 1491.4211 1494.1423 1500.1590 1501.1227 1536.0595 1582.4748 1587.5288 1606.0798 1618.1364 1629.3827 2845.7639 2855.1156 2933.0146 2962.4398 2978.9312 2981.5609 3013.5677 3020.2534 3029.1370 3051.5539 3053.9828 3073.6236 3075.2590 3085.5670 3089.4396 3096.8199 3117.1721 3126.5074 3134.6000 3143.7592 3152.1463 3152.7405 3166.9681 3171.9018 3175.6516 3553.8970 3700.1502
redmass: 3.3430 3.6299 4.4010 4.7411 3.4524 3.6624 4.2188 2.8431 4.2672 4.3979 2.3154 3.8582 4.7673 2.1002 3.3890 3.2453 1.4448 1.2679 1.5031 2.3401 3.4256 3.2434 2.0798 3.8682 3.4363 2.9418 1.3758 2.4969 3.4165 2.9307 4.7753 3.2650 3.2583 3.7100 1.4686 1.9360 3.3459 3.0769 3.4735 6.3622 4.6128 4.5754 6.6020 5.4448 4.9170 3.4154 2.2260 1.5054 3.6838 1.6994 2.7419 1.2206 1.2248 1.3994 3.5270 1.4592 1.6374 3.6492 1.9752 1.3774 1.3982 1.3055 1.5584 3.9897 2.7906 4.3789 2.1728 2.1288 2.1792 2.7566 2.0426 2.6012 2.2401 1.8511 1.2605 1.7706 1.4131 1.5921 2.1451 1.3215 1.0551 1.8463 1.3987 2.2791 2.3259 2.9350 1.6033 1.4829 1.2577 1.8191 1.3005 1.3110 1.9835 1.3316 2.0858 1.3455 1.3849 4.1663 1.3771 1.2611 8.0100 1.2315 4.0900 1.1675 1.1768 2.4339 1.0511 1.0525 1.0501 1.0629 1.0766 1.0685 1.0564 1.0808 1.0737 2.5854 3.0049 7.5854 6.8819 6.9872 1.9888 6.2483 2.0637 1.0715 1.0712 1.0685 1.0327 1.0356 1.0356 1.0878 1.0605 1.0872 1.1040 1.0912 1.0986 1.0987 1.1004 1.1003 1.1059 1.0869 1.0997 1.0880 1.0944 1.0874 1.0879 1.1002 1.0959 1.0966 1.0448 1.1037
irintensity: 0.2957 0.1002 1.5785 0.0966 0.0767 0.3801 0.4650 0.0803 0.5901 2.4614 0.4992 1.4867 6.5431 0.8439 1.1071 3.9646 0.2987 0.7558 5.0251 0.9438 5.5482 4.4654 4.0605 7.2472 1.8927 2.8724 173.1485 51.4846 15.4280 0.0460 6.9616 1.3681 3.9879 3.5179 24.8861 37.6430 15.9712 13.5361 6.3197 1.7998 43.2994 1.9725 4.8110 3.8031 21.6706 3.9537 26.5378 75.8994 5.9250 5.9464 6.7068 4.8232 5.2310 15.8672 5.6053 5.3593 50.7099 13.2806 3.3653 1.5484 1.1558 0.1502 1.7828 17.3606 12.6565 24.9509 5.6270 14.5477 8.3396 6.9058 3.9974 29.4218 43.8298 9.0601 0.1940 71.3901 6.0604 23.5173 15.8758 5.6986 7.1107 57.0902 136.4444 45.3512 8.4222 161.3069 45.0188 14.5238 28.8348 181.9311 68.3251 9.2903 28.8270 21.6476 143.6767 1.9911 33.7469 10.9091 28.3409 14.5672 35.2999 20.4504 26.5223 9.2520 25.2897 6.2221 3.3326 5.7718 13.8739 3.3210 42.4911 3.3655 12.5883 16.8915 13.4642 41.6758 111.3535 171.6581 35.1571 19.4891 8.2687 169.7527 201.1740 40.5075 184.6840 48.2493 66.4384 31.0890 37.5739 18.4560 22.3683 33.3038 44.8540 10.6595 31.6090 69.5994 36.6466 47.6664 11.1051 11.5740 26.9947 2.8006 30.3335 8.6375 0.0819 17.8280 10.9629 4.3359 52.5821 31.7082
temp: 298.150 k
press: 1.00000 atm
elementType: 8 8 7 7 7 6 6 6 6 6 6 6 6 6 6 6 6 6 6 6 6 6 6 6 6 1 1 1 1 1 1 1 1 1 1 1 1 1 1 1 1 1 1 1 1 1 1 1 1 1 1 1
symmnumber: 1
zpe: 1141423.1 jmol-1
zpe.correction: 0.434745 hartree
zpe.thermalcorrener: 0.459978 hartree
zpe.thermalcorrenthalpy: 0.460922 hartree
zpe.thermalcorrgfe: 0.377890 hartree
zpe.sumelectzpe: -1091.140415 hartree
zpe.sumelectthermal: -1091.115182 hartree
zpe.sumelectthermalent: -1091.114238 hartree
zpe.sumelectthermalfe: -1091.197270 hartree
dipole: 1.5417 4.9018 1.1646
dipole: 5.2688
quadrupole: -131.7936 -149.4686 -140.9949
quadrupole: 7.9281 6.0942 10.0632
quadrupole: 8.9588 -8.7162 -0.2425 7.9281 6.0942 10.0632
hfenergy: -1091.5751602 hartree
pointgroup: C01 [X(C20H27N3O2)]
dipole: 0.7443753 -1.7529659 -0.818532 debye
polarizability: 308.1325583|-4.0947357|253.0762306|10.6513908|21.4470499|199.9309275 unknown
InChI: InChI=1S/C20H27N3O2/c1-4-22(5-2)14-15-23(19-9-7-6-8-18(19)21)20(24)16-10-12-17(25-3)13-11-16/h6-13H,4-5,14-15,21H2,1-3H3
charge 0 multiplicity 1
52 atoms
O  -0.585257 2.341619 0.073889
O  5.727503 1.577317 0.752522
N  -4.381237 0.362919 0.244032
N  -0.619718 0.069046 -0.417111
N  -0.160208 -1.697346 -2.561349
C  -2.942084 0.26821 0.58892
C  -2.083678 0.20285 -0.698547
C  -5.101573 -0.931874 0.336963
C  -5.076967 1.508375 0.883467
C  -0.140421 -1.272926 -0.15528
C  0.059582 1.247329 -0.052478
C  -6.33498 -1.010673 -0.584007
C  -4.630477 2.864406 0.30195
C  0.032019 -2.164981 -1.262232
C  1.548541 1.217386 0.138884
C  0.099923 -1.723645 1.160419
C  0.420017 -3.509203 -1.002381
C  0.510283 -3.052165 1.408486
C  2.425253 0.352469 -0.561104
C  2.109788 2.197457 1.004539
C  0.656844 -3.942914 0.318043
C  3.823752 0.441333 -0.393521
C  3.496317 2.288243 1.194168
C  4.360992 1.405211 0.496648
C  6.666657 0.697145 0.050938
H  -2.731931 -0.622026 1.2224
H  -2.629106 1.160087 1.159251
H  -2.248957 1.131806 -1.268748
H  -2.395603 -0.660754 -1.313207
H  -4.391549 -1.727117 0.039451
H  -5.405319 -1.160369 1.391118
H  -6.162437 1.387725 0.711582
H  -4.928862 1.508256 1.993785
H  -7.103461 -0.264664 -0.312293
H  -6.037026 -0.825433 -1.630954
H  -6.803136 -2.010873 -0.51704
H  -3.542224 3.020565 0.414416
H  -4.868035 2.911331 -0.775742
H  -5.149409 3.695838 0.81541
H  -0.033786 -1.018529 1.988497
H  0.549895 -4.204262 -1.841291
H  0.700836 -3.388444 2.432428
H  2.028738 -0.3889 -1.260101
H  1.432253 2.89278 1.509928
H  0.961254 -4.98076 0.495496
H  -0.052665 -2.313619 -3.360896
H  -0.378872 -0.716066 -2.716351
H  4.473678 -0.23526 -0.956139
H  3.935638 3.032248 1.865265
H  7.66287 1.003694 0.401813
H  6.489771 -0.365062 0.308289
H  6.599377 0.831118 -1.046124
