program: Gaussian 09
title: 000057972
version: EM64L-G09RevD.01
frameworkgroup: C1[X(C16H20I3NO5)]
method: RPBEPBE
basis: SDD
operation: Freq
keyword: #p
keyword: freq=noraman
keyword: PBEPBE/SDD
title: #p freq=noraman PBEPBE/SDD
converged: NO YES NO NO
title: Mulliken charges:
elementType: I I I O O O O O N C C C C C C C C C C C C C C C C H H H H H H H H H H H H H H H H H H H H
charge: 0.166820 0.152553 0.131133 -0.283822 -0.272610 -0.434470 -0.275335 -0.269735 -0.483613 -0.135552 -0.297440 -0.389628 -0.244318 -0.405700 -0.692511 0.177352 -0.295023 0.628741 -0.631109 0.767296 -0.562297 -0.569629 -0.119223 0.275004 -0.763688 0.246131 0.189054 0.201378 0.198803 0.217283 0.176487 0.209051 0.241957 0.211379 0.209482 0.212160 0.240401 0.291879 0.214991 0.409158 0.275100 0.326995 0.266466 0.223232 0.265417
chargesum: 0.00000
title: Mulliken charges with hydrogens summed into heavy atoms:
elementType: I I I O O O O O N C C C C C C C C C C C C C C C C
charge: 0.166820 0.152553 0.131133 -0.283822 -0.272610 -0.025312 -0.275335 -0.269735 -0.156618 0.110578 0.092992 0.026459 0.141220 0.047636 -0.030468 0.177352 0.211847 0.628741 -0.631109 0.767296 -0.562297 -0.569629 0.155877 0.275004 -0.008573
polarizability: 3.01467607e+02 -1.41576739e+01 3.30344857e+02 -4.23240785e+01 -1.27965994e+01 1.96728385e+02
1716.lowfreq: -7.9585 -5.4897 -0.0005 -0.0004 -0.0002 5.3715 13.7658 15.8115 22.2949
frequency: 13.7136 15.7332 22.1696 33.4345 43.8423 50.9355 60.4057 65.8757 73.7818 79.7960 85.4919 87.0665 88.8825 92.7122 103.9197 105.3935 130.8271 139.0327 149.2520 163.3382 172.3043 181.5061 192.7869 216.4540 224.9500 234.2028 236.5934 272.3713 289.5500 300.3190 328.7070 333.6921 379.3145 396.7473 408.6710 417.2688 486.6988 507.4554 527.3333 529.9001 554.7875 568.6525 593.1196 604.4932 634.2951 644.6615 696.3168 699.7126 735.5874 747.9246 766.9928 789.3890 821.2654 848.8056 866.6589 870.0617 918.2524 921.2434 942.3510 952.9346 979.0474 985.3367 994.6004 1015.3783 1030.4444 1041.5484 1043.4485 1067.9934 1077.7545 1099.0741 1108.7447 1111.8143 1119.4322 1146.9871 1183.3630 1202.2564 1209.3649 1220.9070 1226.1383 1242.4889 1250.6167 1274.4467 1278.5947 1302.1895 1307.5454 1317.6026 1331.9169 1335.8068 1340.9819 1388.1383 1388.8775 1394.1310 1395.8882 1398.6915 1406.8793 1444.3131 1455.5530 1460.5649 1464.7728 1469.6044 1470.4948 1474.0429 1476.7005 1482.1665 1483.9021 1520.0923 1541.2631 1617.8562 1640.0734 2933.0246 2941.6172 2974.8683 2983.7114 2991.0397 2993.5808 2995.0922 2996.4245 3012.9928 3024.6491 3051.9439 3068.2942 3077.6524 3087.3429 3087.7603 3094.4999 3121.8131 3135.6946 3185.1626 3519.4069
redmass: 7.6064 6.0185 8.3638 7.4852 6.0877 2.8321 5.1886 3.9926 6.6246 19.5131 4.5151 1.2553 3.8234 6.1534 3.1671 3.1385 4.9944 5.1295 5.6427 44.1089 4.0888 2.4520 4.5812 7.4217 1.9612 6.1870 2.5037 3.4407 4.5469 3.0412 4.5932 7.3380 4.5225 5.9131 3.8087 4.2775 3.6459 4.6598 2.1595 4.1916 4.2859 1.9296 4.3953 3.3778 7.3448 7.7843 8.1997 4.2749 6.0910 1.9737 1.4371 7.6414 1.6338 3.0266 2.0789 1.4342 2.3931 2.0246 4.7366 1.0960 2.6534 2.2094 1.9424 5.4281 3.1388 1.9387 2.4193 3.2560 2.2130 2.2426 2.3646 2.0220 2.7349 1.9732 1.3064 1.5162 1.2317 1.5224 3.0971 1.3268 2.3380 1.1713 1.1422 1.3085 3.5842 1.8243 1.4493 1.9576 1.6848 1.3875 1.3678 1.5598 1.6323 1.4921 2.1828 1.1610 1.0961 1.0906 1.4075 1.0839 1.2834 1.0430 1.1133 1.0738 1.0750 8.3913 6.9627 7.5572 6.7410 1.0565 1.0562 1.0583 1.0371 1.0662 1.0925 1.1050 1.0375 1.0697 1.0982 1.0891 1.0991 1.0997 1.1001 1.0983 1.1045 1.0994 1.0691 1.0932 1.0768
irintensity: 0.0589 0.3340 0.2946 1.5261 1.7899 0.2433 6.4230 1.2155 0.1330 0.8845 2.3357 0.1733 0.8595 0.3401 1.0729 1.3738 0.4400 4.6117 0.6968 0.1908 13.9626 7.4682 1.2100 3.1531 2.8094 1.8779 4.6263 4.9986 11.0218 0.4955 2.1097 1.2369 4.6272 1.6201 4.5117 12.8648 11.0344 5.1021 28.3685 9.5821 19.7301 33.9251 3.4965 8.8568 77.5043 16.0427 36.9114 0.7154 14.4664 31.7136 1.2540 10.0506 2.1711 17.0201 5.9448 20.7917 26.5744 29.2558 14.2245 188.4058 11.1625 80.7566 1.3542 37.8789 1.4734 6.3970 7.5439 112.0199 29.6345 20.3166 7.1368 9.0209 169.6262 86.1102 38.0814 32.4101 29.7451 24.1610 37.7150 12.3994 51.4236 1.3046 6.6075 14.2532 67.1948 8.0601 5.8950 107.1547 61.6634 3.8506 78.4821 13.3145 72.6725 14.8754 64.3823 97.8947 7.9097 0.4264 138.1544 1.8542 99.6263 8.5164 3.1993 1.4602 23.9355 23.4895 32.9973 165.9119 268.0468 26.2630 111.9937 52.0496 33.2997 26.5670 36.9512 27.4242 7.0470 66.5550 8.6428 20.6458 9.7286 51.8666 67.3915 10.9927 15.5525 30.2312 1179.0064 0.3206 30.7142
temp: 298.150 k
press: 1.00000 atm
elementType: 53 53 53 8 8 8 8 8 7 6 6 6 6 6 6 6 6 6 6 6 6 6 6 6 6 1 1 1 1 1 1 1 1 1 1 1 1 1 1 1 1 1 1 1 1
symmnumber: 1
zpe: 884736.2 jmol-1
zpe.correction: 0.336978 hartree
zpe.thermalcorrener: 0.366084 hartree
zpe.thermalcorrenthalpy: 0.367029 hartree
zpe.thermalcorrgfe: 0.270065 hartree
zpe.sumelectzpe: -1085.184417 hartree
zpe.sumelectthermal: -1085.155311 hartree
zpe.sumelectthermalent: -1085.154366 hartree
zpe.sumelectthermalfe: -1085.251330 hartree
dipole: 1.2896 -2.1308 0.8853
dipole: 2.6433
quadrupole: -173.3336 -167.5625 -194.4321
quadrupole: -17.0205 3.2511 -10.6505
quadrupole: 5.1092 10.8803 -15.9894 -17.0205 3.2511 -10.6505
hfenergy: -1085.5213949 hartree
pointgroup: C01 [X(C16H20I3N1O5)]
dipole: -0.6643138 0.7465135 0.2879145 debye
polarizability: 270.1990541|-32.1798878|320.5464739|59.9566028|27.0062622|237.7953211 unknown
InChI: InChI=1S/C16H20I3NO5/c1-3-10(16(22)23)8-24-5-4-6-25-15-12(18)7-11(17)14(13(15)19)20-9(2)21/h7,10,20,22H,3-6,8H2,1-2H3
charge 0 multiplicity 1
45 atoms
I  -0.93994 -0.043857 2.522535
I  -2.146848 -4.12481 -1.86491
I  -4.692859 1.424639 -2.19169
O  3.279798 -1.463893 1.21117
O  -0.755913 -2.683243 0.69078
O  2.006809 1.948659 0.51709
O  2.044557 0.311909 -1.129779
O  -0.580292 2.455652 0.120778
N  -2.790717 1.812481 0.459523
C  4.033166 0.649617 0.291171
C  4.266024 -0.869762 0.300323
C  5.06947 1.350448 -0.639084
C  3.046988 -2.904825 1.024629
C  1.564311 -3.17669 1.329304
C  5.025266 2.891291 -0.568941
C  2.605833 0.930167 -0.186724
C  0.683921 -2.497568 0.282944
C  -1.625015 -1.779203 0.08274
C  -1.827733 -0.478444 0.627212
C  -2.66061 0.47336 -0.023625
C  -2.37618 -2.154931 -1.061255
C  -3.388372 0.051792 -1.170406
C  -3.274925 -1.258057 -1.674994
C  -1.752368 2.73961 0.498006
C  -2.120111 4.103182 1.060642
H  4.133608 1.046121 1.317105
H  5.299919 -1.095616 0.63997
H  4.122664 -1.270897 -0.72591
H  6.080961 0.998338 -0.352048
H  4.895998 1.013941 -1.680463
H  3.290484 -3.198917 -0.020435
H  3.699175 -3.48371 1.710668
H  1.319812 -2.773649 2.328406
H  1.377631 -4.267263 1.346534
H  5.779679 3.334803 -1.244251
H  5.231617 3.247289 0.457213
H  4.033476 3.279727 -0.859015
H  0.90785 -1.419684 0.220124
H  0.80593 -2.952757 -0.719355
H  1.04018 2.116702 0.252673
H  -3.850805 -1.566729 -2.549183
H  -3.734266 2.152122 0.663472
H  -1.780123 4.158145 2.11121
H  -3.203539 4.310456 1.033051
H  -1.58471 4.881354 0.494693
