program: Gaussian 09
title: 000057829
version: EM64L-G09RevD.01
frameworkgroup: C1[X(C8H14Cl2O)]
method: RPBEPBE
basis: SDD
operation: Freq
keyword: #p
keyword: freq=noraman
keyword: PBEPBE/SDD
title: #p freq=noraman PBEPBE/SDD
converged: YES YES NO NO
title: Mulliken charges:
elementType: Cl Cl O C C C C C C C C H H H H H H H H H H H H H H
charge: 0.019861 0.006424 -0.240185 -0.005900 -0.315209 -0.459576 -0.290490 -0.416381 -0.033805 -0.710518 -0.708783 0.250540 0.270172 0.281416 0.230647 0.205528 0.219833 0.213072 0.206704 0.214967 0.206304 0.215618 0.207931 0.213203 0.218626
chargesum: 0.00000
title: Mulliken charges with hydrogens summed into heavy atoms:
elementType: Cl Cl O C C C C C C C C
charge: 0.019861 0.006424 -0.240185 0.244640 -0.315209 0.092012 0.145685 0.016524 0.172899 -0.073629 -0.069022
polarizability: 1.23476793e+02 -3.94909009e+00 1.01225588e+02 6.67668181e+00 -1.34616842e+00 9.66171155e+01
1716.lowfreq: -10.0389 -0.0007 0.0029 0.0032 4.9952 6.9414 18.9932 31.4106 56.1055
frequency: 17.8863 31.2727 56.0809 90.7335 123.0970 161.7126 178.6740 210.9449 224.4327 234.2043 261.0060 292.6057 354.7918 355.2954 382.0321 425.3035 436.1816 530.8769 547.2925 687.0250 774.0345 789.5430 807.9516 889.2452 912.7755 931.2951 951.2417 955.8998 977.7291 988.9668 1016.5132 1030.8855 1074.9320 1089.4605 1130.8273 1142.1875 1150.3989 1193.3990 1208.4372 1239.1484 1284.5472 1286.2882 1326.4599 1330.6269 1351.4380 1378.6566 1395.6203 1395.9703 1426.1068 1464.7253 1465.6694 1476.5027 1483.6854 1487.0440 1490.7198 2959.0923 2966.2651 2969.7107 2973.6436 2991.6222 3022.4276 3054.2543 3061.4807 3063.9158 3068.5301 3069.5253 3072.4793 3111.0720 3221.4554
redmass: 3.1485 4.8554 7.0556 2.8470 2.1193 3.9080 5.2785 1.2506 2.5661 1.3307 5.8029 3.7230 2.0728 2.6455 3.6632 4.7797 3.1239 5.5590 2.4718 3.1807 2.5706 1.1705 2.3642 5.0603 1.1884 4.9113 1.2960 2.1487 2.2559 1.7029 1.8709 1.9311 1.4001 1.5943 2.2295 2.1644 1.7487 1.9180 1.2219 1.9445 1.1236 1.5831 1.4694 1.4643 1.3946 1.2106 1.3749 1.2254 1.3022 1.0692 1.0578 1.0545 1.0653 1.0595 1.0649 1.0585 1.0796 1.0356 1.0365 1.0631 1.1011 1.1048 1.0998 1.0884 1.0997 1.0989 1.0991 1.0569 1.1159
irintensity: 0.1243 0.6443 0.1786 0.3289 2.7385 4.6236 3.0423 0.0502 0.4211 0.0902 2.9539 1.5510 0.1508 0.0579 1.5597 11.1521 2.9090 25.8629 3.0728 76.4848 1.8799 2.1700 7.6672 2.0946 2.6444 71.6021 0.0178 11.8764 8.4026 0.3111 6.4981 72.1189 27.4930 43.7062 40.1856 21.1233 5.6579 8.2738 0.3053 18.4232 0.9947 5.1577 33.0572 2.6540 6.2873 21.1791 2.3819 14.5090 29.6956 4.3861 3.0662 2.9975 20.3837 4.4619 14.4822 25.6982 18.2338 40.9946 27.8002 36.2683 9.3970 45.7512 9.4091 19.3904 43.4155 80.5370 74.7791 0.9515 0.9952
temp: 298.150 k
press: 1.00000 atm
elementType: 17 17 8 6 6 6 6 6 6 6 6 1 1 1 1 1 1 1 1 1 1 1 1 1 1
symmnumber: 1
zpe: 535363.9 jmol-1
zpe.correction: 0.203909 hartree
zpe.thermalcorrener: 0.217507 hartree
zpe.thermalcorrenthalpy: 0.218451 hartree
zpe.thermalcorrgfe: 0.161302 hartree
zpe.sumelectzpe: -1307.638132 hartree
zpe.sumelectthermal: -1307.624535 hartree
zpe.sumelectthermalent: -1307.623591 hartree
zpe.sumelectthermalfe: -1307.680740 hartree
dipole: -1.6206 -1.4954 0.1727
dipole: 2.2119
quadrupole: -79.6086 -81.3637 -82.6646
quadrupole: -5.3188 -3.0968 -1.2134
quadrupole: 1.6037 -0.1514 -1.4523 -5.3188 -3.0968 -1.2134
hfenergy: -1307.8420418 hartree
pointgroup: C01 [X(C8H14Cl2O1)]
dipole: -0.6165151 -0.6016856 0.1231756 debye
dipolederiv: -0.1958594 0.0949777 -0.0987405 0.0757281 -0.5245266 0.2007515 -0.0705045 0.2439395 -0.2889133 -0.4013934 -0.0950496 -0.290757 -0.0968446 -0.2310861 -0.0858874 -0.363691 -0.1233817 -0.5820057 -1.3549706 -0.052057 -0.0354949 0.0872045 -0.4180121 -0.0198763 -0.0980994 -0.0096357 -0.3557552 0.7657899 0.1418827 0.1026613 0.0275519 0.2650396 0.0511406 0.3629866 0.00856 0.2175864 0.5486297 -0.1123331 0.3688665 -0.1021931 0.6077183 -0.1411181 0.3482912 -0.1191316 0.9348994 -0.2217639 0.0430715 0.0716806 0.1035029 -0.1830913 -0.1253402 0.1294249 -0.1010143 -0.1487449 0.789073 -0.0201925 -0.0719481 -0.1433623 0.3676428 -0.038779 -0.2777861 -0.0922925 0.2480282 -0.0789862 0.0262804 0.0126712 0.058291 0.0816861 -0.0036212 0.0448589 0.0162968 0.0550242 0.2194494 -0.0096173 -0.0030016 -0.0376403 0.1556041 -0.007026 -0.0565487 -0.0087432 0.14646 0.0199155 -0.0122976 0.0678148 0.0115595 -0.0046048 0.0623613 0.0861869 0.0521591 -0.0158859 0.0284555 -0.0027787 0.0296636 0.0009737 -0.092879 -0.0242046 0.0593163 -0.0152149 0.0534497 -0.0387923 -0.032886 0.0194382 -0.0393104 0.0205753 0.0813936 -0.0718639 0.0863511 -0.0693994 0.0121941 0.069514 -0.0004123 0.0726138 0.0570563 0.0301889 -0.0463526 0.0266639 0.0761798 0.1049099 0.0192255 -0.0500038 0.0078898 0.1119842 -0.009763 0.0052798 0.0040937 0.0025385 0.0082167 -0.0557895 -0.0201177 0.0226661 -0.1128149 -0.0712336 0.0406237 -0.0440096 0.016706 -0.0098225 0.0148643 0.0097745 -0.0057679 -0.0214602 0.1109345 0.0935873 0.0811312 -0.1282567 0.028985 -0.0238095 0.062218 -0.0449286 0.0269393 0.1133384 0.0321288 0.0804701 -0.0877247 0.0436353 -0.011587 -0.0167843 -0.0175492 -0.1541656 -0.0852174 -0.0379566 -0.0439839 0.0589439 -0.1153118 -0.0177577 -0.1149737 -0.0070672 0.0254912 -0.0197267 -0.1162496 -0.0194511 -0.1051429 -0.1715375 0.0535849 0.0934415 0.1005609 0.0699483 -0.0235552 0.0735208 -0.0053496 0.0532062 -0.0064806 -0.0217121 -0.1488049 -0.0453323 0.0680791 -0.0290397 -0.1177667 0.0009319 -0.0772085 0.1103424 0.0018015 0.0042408 -0.0345697 -0.1901145 -0.0165028 -0.0102478 -0.0531915 0.0583838 0.0007548 -0.044688 -0.1303803 -0.0161415 0.0561989 0.001934 -0.1424833 -0.0402087 -0.0701975 -0.1561161 0.1288973 0.0565622 0.0847066 0.0288469 -0.0321306 0.0634781 -0.0444935 0.0786776 0.0706831 -0.0815441 0.0823857 -0.0625414 -0.0100553 0.0809791 0.0698668 0.1195048 -0.070849 unknown
polarizability: 122.6511105|-1.5068156|100.4420009|8.9743406|-1.7384571|98.2263851 unknown
InChI: InChI=1S/C8H14Cl2O/c1-6(2)3-4-11-7-5-8(7,9)10/h6-7H,3-5H2,1-2H3
charge 0 multiplicity 1
25 atoms
Cl 2.054643 1.713257 -0.719555
Cl 3.459242 0.5813 1.764571
O  0.367123 -0.980683 -0.536564
C  1.554497 -0.99637 0.2420
C  2.513992 0.202421 0.220077
C  2.877093 -1.055638 -0.548643
C  -0.793978 -0.39608 0.1890
C  -1.979819 -0.458731 -0.777887
C  -3.310877 0.118168 -0.217052
C  -3.836163 -0.679665 1.00262
C  -3.209954 1.629045 0.109407
H  1.493147 -1.533621 1.201332
H  3.688508 -1.682948 -0.170988
H  2.78468 -1.003671 -1.637701
H  -0.54664 0.644447 0.475435
H  -0.977689 -0.990975 1.108113
H  -1.698838 0.092755 -1.695927
H  -2.130481 -1.515999 -1.070945
H  -4.05637 0.004742 -1.031874
H  -4.847191 -0.335839 1.289516
H  -3.181659 -0.549426 1.885257
H  -3.896111 -1.761621 0.779675
H  -2.544505 1.815163 0.973444
H  -4.203797 2.041501 0.364091
H  -2.814853 2.200369 -0.751301
