program: Gaussian 09
title: 000006531
version: EM64L-G09RevD.01
frameworkgroup: C1[X(C12H26O6P2S4)]
method: RPBEPBE
basis: SDD
operation: Freq
keyword: #p
keyword: freq=noraman
keyword: PBEPBE/SDD
title: #p freq=noraman PBEPBE/SDD
converged: YES YES NO NO
title: Mulliken charges:
elementType: S S S S P P O O O O O O C C C C C C C C C C C C H H H H H H H H H H H H H H H H H H H H H H H H H H
charge: 0.047269 0.047197 -0.218114 -0.218080 0.607128 0.607213 -0.224387 -0.224423 -0.467946 -0.466194 -0.466230 -0.467900 -0.305026 -0.304909 -0.288247 -0.288164 -0.218123 -0.212185 -0.212159 -0.218136 -0.653155 -0.657653 -0.657716 -0.653134 0.308571 0.308541 0.216985 0.222522 0.216970 0.222508 0.229907 0.236074 0.228241 0.250659 0.228271 0.250618 0.229945 0.236018 0.234242 0.237832 0.213119 0.230385 0.236950 0.211098 0.211098 0.236977 0.230388 0.213113 0.237805 0.234238
chargesum: 0.00000
title: Mulliken charges with hydrogens summed into heavy atoms:
elementType: S S S S P P O O O O O O C C C C C C C C C C C C
charge: 0.047269 0.047197 -0.218114 -0.218080 0.607128 0.607213 -0.224387 -0.224423 -0.467946 -0.466194 -0.466230 -0.467900 0.003545 0.003632 0.151260 0.151314 0.247858 0.266715 0.266730 0.247827 0.032037 0.020781 0.020747 0.032021
polarizability: 3.41782498e+02 -5.58248220e-03 3.11545335e+02 -2.01839477e+01 -8.95342915e-03 2.28336785e+02
1716.lowfreq: -9.4759 -5.9347 -1.3984 -0.0016 -0.0013 0.0007 12.7224 15.9457 16.6331
frequency: 11.6664 15.9086 16.5609 27.9973 30.0800 36.1966 39.2428 41.2657 59.8885 63.2277 70.5474 70.8605 80.7548 83.5519 87.9107 94.1965 103.9393 107.9823 115.7797 130.3989 131.8580 168.5643 168.6141 190.3988 202.2399 236.2009 238.4281 243.6326 245.2102 257.9114 258.0510 264.9523 278.2716 289.1404 293.8162 301.8192 317.4898 323.5187 330.1911 335.9295 378.5024 386.5108 397.4333 425.3769 429.8565 433.0994 433.6070 537.1394 543.2963 549.2062 674.1798 674.5266 712.8015 715.2099 763.9576 765.4481 814.0839 814.5424 815.1225 815.2043 823.4408 828.5261 862.6258 863.0452 888.3114 888.4170 917.7221 918.2759 1011.5170 1013.8436 1014.2472 1025.2893 1025.8644 1036.1857 1044.5264 1092.3083 1102.8758 1103.0809 1108.1397 1108.5515 1136.5390 1136.6422 1139.8191 1140.1656 1195.9709 1217.5577 1218.6922 1259.3534 1260.9019 1261.2315 1262.5100 1262.8437 1267.5518 1320.5550 1340.3744 1353.9539 1357.2079 1357.2522 1361.1646 1361.6052 1393.0111 1393.1629 1396.7153 1396.7942 1444.8667 1446.7862 1456.6335 1456.6713 1457.5302 1457.5543 1473.6049 1473.7936 1474.3575 1474.6667 1483.8290 1483.8737 1486.6105 1486.7241 2977.0567 2983.5827 2985.0882 2985.3127 2990.5889 2990.6387 2995.5855 2995.6163 2995.7096 2997.1488 2997.1613 3005.9942 3053.4988 3053.7333 3059.9263 3060.0056 3087.0013 3090.3351 3091.8434 3091.8711 3093.4861 3093.5651 3109.4878 3109.5536 3111.8514 3111.8737
redmass: 7.3252 5.4451 5.2093 4.6865 3.4898 4.4529 3.4017 3.9083 6.6305 4.5318 3.1162 2.7025 2.4370 2.2582 2.0701 1.9426 6.5432 4.7071 6.4649 8.7832 10.0604 6.7748 4.3388 3.5125 4.3381 1.5596 1.4137 2.3298 2.1634 1.7138 1.7190 3.0673 4.7876 5.0317 4.6330 6.5930 5.2767 6.9998 2.2175 6.1311 8.8196 7.6717 8.6764 5.9403 7.9197 5.7166 6.8634 2.6158 10.0316 12.8689 6.1011 6.0994 7.9546 7.9327 5.0958 3.1687 1.1133 1.0968 1.0907 1.0920 4.3395 5.1485 4.8231 4.7602 3.6134 3.5973 3.7258 4.0411 2.9167 2.3316 2.3441 2.8842 2.8771 4.2360 6.1282 2.0372 2.2562 2.2550 2.2142 2.2157 1.4348 1.4352 1.4347 1.4331 1.0935 1.1776 1.1286 1.2005 1.1339 1.1364 1.1314 1.1318 1.2086 1.1657 1.2458 1.2504 1.2524 1.2525 1.2440 1.2422 1.2489 1.2487 1.2399 1.2407 1.0891 1.0916 1.0399 1.0399 1.0394 1.0395 1.0588 1.0552 1.0610 1.0572 1.0688 1.0690 1.0736 1.0732 1.0677 1.0611 1.0559 1.0557 1.0540 1.0539 1.0653 1.0404 1.0555 1.0369 1.0369 1.0855 1.1082 1.1081 1.1083 1.1083 1.0976 1.1034 1.0983 1.0983 1.0981 1.0981 1.1023 1.1023 1.1024 1.1024
irintensity: 0.0975 0.0298 0.0935 0.4001 0.0205 0.2868 0.0211 1.0983 0.4419 0.4868 2.3529 0.0194 0.6475 1.0179 0.7938 15.1212 0.3350 5.2081 7.4288 1.0431 1.0285 1.0020 5.3164 0.2574 0.5936 10.0879 0.0933 1.1523 0.9957 1.7460 0.3575 23.1475 0.2490 23.5941 0.1177 1.0763 9.0655 16.5894 1.3099 0.8629 0.6094 83.0739 15.8665 128.3412 0.2465 2.5312 1.8323 0.4774 261.7374 69.5368 34.1146 54.7480 74.9835 91.0732 47.4590 39.1802 1.5414 1.7131 1.8124 21.3426 0.8468 11.7564 291.5969 235.3079 36.5966 9.7876 115.5344 29.8910 3.5049 175.2494 157.8680 1.1050 11.2925 140.0262 32.4469 1.8607 10.1883 11.3462 1.5541 1.4272 0.8332 1.1447 12.7849 2.9190 4.0813 8.6172 18.6367 2.6036 0.1040 0.0023 0.0766 0.4386 10.9060 3.0655 0.2905 4.4586 11.8786 8.9597 3.8783 2.9742 17.4599 40.8134 59.2341 0.1030 13.3379 1.6426 15.9934 3.7768 7.5028 18.0339 7.5479 5.0579 2.9237 2.5478 8.0114 10.1783 18.1186 9.9533 40.4275 45.9088 33.9279 7.0668 23.6261 20.3484 10.7838 19.1855 22.7638 22.9460 9.0589 1.9555 4.2042 20.0984 5.1631 4.3848 36.5352 15.3387 25.6322 32.5129 2.0394 36.2220 46.2618 12.9923 8.5648 65.2126
temp: 298.150 k
press: 1.00000 atm
elementType: 16 16 16 16 15 15 8 8 8 8 8 8 6 6 6 6 6 6 6 6 6 6 6 6 1 1 1 1 1 1 1 1 1 1 1 1 1 1 1 1 1 1 1 1 1 1 1 1 1 1
symmnumber: 1
zpe: 1008372.3 jmol-1
zpe.correction: 0.384069 hartree
zpe.thermalcorrener: 0.417603 hartree
zpe.thermalcorrenthalpy: 0.418548 hartree
zpe.thermalcorrgfe: 0.312050 hartree
zpe.sumelectzpe: -3196.922438 hartree
zpe.sumelectthermal: -3196.888903 hartree
zpe.sumelectthermalent: -3196.887959 hartree
zpe.sumelectthermalfe: -3196.994457 hartree
dipole: 0.0028 4.7485 0.0019
dipole: 4.7485
quadrupole: -203.0727 -170.0219 -190.8215
quadrupole: -0.0179 -0.2759 0.0020
quadrupole: -15.1007 17.9501 -2.8494 -0.0179 -0.2759 0.0020
hfenergy: -3197.3065069 hartree
pointgroup: C01 [X(C12H26O6P2S4)]
dipole: 0.0053209 0.0027699 1.8682099 debye
polarizability: 325.5056974|44.5977905|244.6133747|-0.1149225|0.0253419|311.5455463 unknown
InChI: InChI=1S/2C4H10O2PS.C4H6O2S2/c2*1-3-5-7(8)6-4-2;7-3-4(8)6-2-1-5-3/h2*3-4H2,1-2H3;3-4H,1-2H2
charge 0 multiplicity 1
50 atoms
S  1.009939 1.44399 -0.518431
S  -1.012276 -1.445179 -0.510968
S  4.051284 1.846133 -2.498363
S  -4.063627 -1.856274 -2.473755
P  3.177142 0.757634 -0.984216
P  -3.182318 -0.761825 -0.968129
O  0.945953 1.079045 2.153537
O  -0.937866 -1.073673 2.159931
O  3.024261 -0.959629 -1.135625
O  3.927817 0.656675 0.568405
O  -3.92544 -0.654784 0.587775
O  -3.030837 0.954856 -1.126817
C  0.723238 0.276609 0.934812
C  -0.719975 -0.274267 0.938316
C  0.726946 0.261218 3.372245
C  -0.71424 -0.252675 3.375678
C  2.498499 -1.494161 -2.431043
C  4.19417 1.938959 1.293976
C  -4.188943 -1.933983 1.319742
C  -2.508653 1.484466 -2.425696
C  2.513863 -3.012013 -2.288501
C  4.973026 1.548615 2.545318
C  -4.959818 -1.537875 2.574223
C  -2.523811 3.002853 -2.288986
H  1.45853 -0.55116 0.874931
H  -1.455587 0.553289 0.879317
H  1.441526 -0.587243 3.387878
H  0.929196 0.94184 4.215776
H  -1.428797 0.595797 3.391836
H  -0.913186 -0.931083 4.221776
H  1.47157 -1.10851 -2.582477
H  3.153441 -1.142676 -3.250371
H  4.777921 2.608878 0.634009
H  3.221501 2.402642 1.541558
H  -4.777483 -2.605621 0.665813
H  -3.215421 -2.397937 1.563396
H  -1.482108 1.098274 -2.578334
H  -3.165746 1.129906 -3.241982
H  3.536992 -3.37756 -2.098817
H  1.861294 -3.333332 -1.459336
H  2.142239 -3.473962 -3.221772
H  4.376717 0.868458 3.177096
H  5.918099 1.045762 2.280156
H  5.208969 2.455227 3.132681
H  -5.193704 -2.441953 3.166299
H  -5.905659 -1.034508 2.312792
H  -4.358755 -0.856335 3.19999
H  -2.15459 3.461203 -3.224981
H  -1.869192 3.327457 -1.462723
H  -3.546497 3.369029 -2.098139
