program: Orca
programVersion: 5.0.2
elementType: O O O N C C C C C C C C C C C C C C C C C C H H H H H H H H H H H H H
charge: 0
multiplicity: 1
keywords: wb97x-d3
keywords: def2-TZVPP
keywords: def2/J RIJCOSX
keywords: DEFGRID2
keywords: scfconv7
keywords: smallprint printgap noloewdin
keywords: NOSOSCF
formula: C18H13NO3
InChI: InChI=1/C18H13NO3/c20-17(14-9-3-4-10-15(14)18(21)22)19-16-11-5-7-12-6-1-2-8-13(12)16/h1-11,19,21H
35 atoms
O  -1.296365 2.642078 0.633377
O  -4.673689 0.917199 -0.879249
O  -2.621154 1.335208 -1.648664
N  0.41708 1.442078 -0.190191
C  2.432524 0.074735 -0.221206
C  1.075225 0.268324 -0.606223
C  3.099633 -1.098711 -0.663891
C  0.438219 -0.658295 -1.389946
C  3.144733 0.997264 0.58125
C  2.401785 -2.050209 -1.441917
C  4.453878 -1.297499 -0.308416
C  -1.523226 0.296764 0.749753
C  1.09911 -1.833916 -1.789696
C  -0.805409 1.554151 0.369248
C  4.455821 0.776234 0.905392
C  -2.808096 0.011978 0.278864
C  5.120877 -0.380202 0.454484
C  -0.957669 -0.511514 1.728082
C  -3.502901 -1.077224 0.794863
C  -1.654199 -1.600307 2.229722
C  -2.92754 -1.885223 1.761091
C  -3.474249 0.801503 -0.788672
H  0.920926 2.315682 -0.287436
H  -0.577978 -0.489254 -1.717627
H  2.658365 1.889994 0.950861
H  2.917634 -2.946851 -1.761583
H  4.95477 -2.193086 -0.654718
H  0.566699 -2.554994 -2.394638
H  4.984788 1.494083 1.517694
H  6.157875 -0.540177 0.717388
H  0.028734 -0.283853 2.111591
H  -4.492773 -1.307561 0.425115
H  -1.201311 -2.221657 2.990365
H  -3.474001 -2.735088 2.145879
H  -3.091099 1.864243 -2.31304
elementType: O N C H
totalener: -974.31076687 hartree
nucrepener: 1694.10160044 hartree
electener: -2668.41236731 hartree
oneelecener: -4689.61938128 hartree
twoeener: 2021.20701398 hartree
cpcmener: -0.04700997 hartree
kineticenergy: 970.20707922 hartree
xcener: -93.625461956166 hartree
chargesum: -0.0000000
charge: -0.507715 -0.462000 -0.274198 -0.132200 -0.026226 0.197118 -0.076637 -0.164494 -0.228395 -0.148177 -0.079357 -0.041463 -0.133159 0.359866 -0.122894 -0.039288 -0.168025 -0.121345 -0.118462 -0.139789 -0.148828 0.443678 0.176092 0.149931 0.141012 0.146948 0.147448 0.159890 0.160402 0.160805 0.154232 0.144809 0.166113 0.165359 0.258949
qa: -0.5077 -0.4620 -0.2742 -0.1322 -0.0262 0.1971 -0.0766 -0.1645 -0.2284 -0.1482 -0.0794 -0.0415 -0.1332 0.3599 -0.1229 -0.0393 -0.1680 -0.1213 -0.1185 -0.1398 -0.1488 0.4437 0.1761 0.1499 0.1410 0.1469 0.1474 0.1599 0.1604 0.1608 0.1542 0.1448 0.1661 0.1654 0.2589
va: 1.9924 2.0326 2.1847 3.1818 3.8284 3.5930 3.8997 3.9270 3.9677 3.9352 3.8524 3.6597 3.9401 4.1595 3.8945 3.6529 3.9203 3.9159 3.9499 3.9156 3.9212 4.2136 1.0157 1.0159 1.0144 1.0029 1.0024 0.9910 0.9910 0.9895 0.9950 1.0130 0.9871 0.9881 0.9934
dispcorr: -0.017551313 hartree
energy: -974.328318184098
dipole: 9.59793 -7.16983 2.42810 -7.12246 5.24960 -1.87286 1.57234 -1.95931 -0.38697
magnitude: 3.09080 au
magnitude: 7.85619 debye
