program: Orca
programVersion: 5.0.2
elementType: O O O N C C C C C C C C C C C C C C C C C C H H H H H H H H H H H H H
charge: 0
multiplicity: 1
keywords: wb97x-d3
keywords: def2-TZVPP
keywords: def2/J RIJCOSX
keywords: DEFGRID2
keywords: scfconv7
keywords: smallprint printgap noloewdin
keywords: NOSOSCF
formula: C18H13NO3
InChI: InChI=1/C18H13NO3/c20-17(14-9-3-4-10-15(14)18(21)22)19-16-11-5-7-12-6-1-2-8-13(12)16/h1-11,19,21H
35 atoms
O  -1.368441 2.674111 0.400531
O  -4.721908 0.821857 -0.772726
O  -2.727988 1.171904 -1.710951
N  0.431251 1.495652 -0.270448
C  2.397491 0.059742 -0.227695
C  1.083468 0.325392 -0.703328
C  3.067647 -1.101698 -0.691893
C  0.476547 -0.537596 -1.576917
C  3.057407 0.90052 0.697517
C  2.402834 -1.979972 -1.57639
C  4.38226 -1.360179 -0.242976
C  -1.479278 0.33306 0.700983
C  1.13319 -1.707801 -1.997414
C  -0.830607 1.604476 0.239161
C  4.328751 0.619659 1.116133
C  -2.777903 -0.006256 0.318372
C  5.003277 -0.518252 0.635765
C  -0.837665 -0.422049 1.674677
C  -3.417711 -1.080392 0.926289
C  -1.475748 -1.500288 2.265581
C  -2.768888 -1.829949 1.892273
C  -3.52787 0.714171 -0.744361
H  0.878764 2.380999 -0.460809
H  -0.513137 -0.313178 -1.950462
H  2.547752 1.770186 1.090576
H  2.914859 -2.871839 -1.91556
H  4.892467 -2.243321 -0.607646
H  0.627223 -2.381029 -2.676045
H  4.818188 1.273258 1.825761
H  6.010514 -0.727269 0.9705
H  0.164623 -0.15766 1.986842
H  -4.428074 -1.329194 0.631131
H  -0.963094 -2.077684 3.023198
H  -3.273987 -2.667663 2.353658
H  -3.259167 1.684112 -2.335005
totalener: -974.28725311 hartree
nucrepener: 1697.12686973 hartree
electener: -2671.41412284 hartree
oneelecener: -4695.14934281 hartree
twoeener: 2023.73521998 hartree
kineticenergy: 970.26988441 hartree
xcener: -93.624326177813 hartree
chargesum: 0.0000000
charge: -0.349068 -0.337013 -0.264237 -0.171438 -0.013748 0.165069 -0.084935 -0.115842 -0.220301 -0.105854 -0.046405 -0.044866 -0.105469 0.295211 -0.096816 -0.038001 -0.134267 -0.091921 -0.096006 -0.123935 -0.116912 0.369355 0.144625 0.132130 0.125290 0.111248 0.111988 0.125796 0.128219 0.126880 0.126794 0.131760 0.130493 0.130458 0.201718
qa: -0.3491 -0.3370 -0.2642 -0.1714 -0.0137 0.1651 -0.0849 -0.1158 -0.2203 -0.1059 -0.0464 -0.0449 -0.1055 0.2952 -0.0968 -0.0380 -0.1343 -0.0919 -0.0960 -0.1239 -0.1169 0.3694 0.1446 0.1321 0.1253 0.1112 0.1120 0.1258 0.1282 0.1269 0.1268 0.1318 0.1305 0.1305 0.2017
va: 2.1704 2.1607 2.1676 3.1210 3.8456 3.6729 4.0394 3.9873 4.0004 3.9852 3.9081 3.7059 4.0009 4.1980 3.9874 3.7367 3.9898 3.9679 3.9779 3.9932 3.9463 4.2674 1.0336 1.0291 1.0263 1.0127 1.0118 1.0028 1.0016 1.0007 0.9991 1.0160 0.9993 0.9996 1.0455
dispcorr: -0.017689772 hartree
energy: -974.304942883202
dipole: 9.72159 -8.09621 1.62538 -7.02442 5.78731 -1.23711 1.89620 -2.12676 -0.23056
magnitude: 2.05559 au
magnitude: 5.22491 debye
