program: Gaussian 09
title: 000057773
version: EM64L-G09RevD.01
frameworkgroup: C1[X(C15H21NO2)]
method: RPBEPBE
basis: SDD
operation: Freq
keyword: #p
keyword: freq=noraman
keyword: PBEPBE/SDD
title: #p freq=noraman PBEPBE/SDD
converged: YES YES NO NO
title: Mulliken charges:
elementType: O O N C C C C C C C C C C C C C C C H H H H H H H H H H H H H H H H H H H H H
charge: -0.270022 -0.242484 -0.087115 -0.356989 -0.371621 -0.443217 -0.448857 -0.374476 -0.271894 0.018974 0.123343 0.344773 0.366223 -0.435369 -0.428245 -0.806966 -0.804092 -0.215973 0.230665 0.176701 0.184318 0.224535 0.230900 0.206740 0.216552 0.227230 0.185212 0.231445 0.239261 0.239696 0.236378 0.233621 0.217493 0.265333 0.229089 0.218522 0.256368 0.226051 0.227896
chargesum: 0.00000
title: Mulliken charges with hydrogens summed into heavy atoms:
elementType: O O N C C C C C C C C C C C C C C C
charge: -0.270022 -0.242484 -0.087115 0.050377 0.037232 -0.005577 -0.005075 0.042181 0.207063 0.018974 0.123343 0.344773 0.366223 -0.198990 -0.194624 -0.095051 -0.103151 0.011923
polarizability: 2.34582997e+02 3.85084423e+00 1.72709139e+02 1.16864854e+01 -1.01368840e+00 1.20240305e+02
1716.lowfreq: -10.1069 -6.5886 -5.1479 -0.0006 0.0004 0.0006 11.9660 19.1049 30.8001
frequency: 11.2063 18.4460 30.7075 41.0022 49.9947 83.5182 83.8940 118.1805 142.2838 144.9792 162.5466 196.4868 210.2965 217.0061 250.5453 263.6141 309.5909 326.4595 359.0985 383.2126 418.9448 451.9169 517.7985 525.8685 547.7299 567.0039 603.2402 634.7119 691.3747 728.7059 766.6186 772.0811 783.6764 798.0136 811.1995 841.0533 866.7514 901.3542 902.5089 907.9252 927.7675 961.2118 967.2903 983.9189 995.6393 1033.0581 1045.2530 1047.0086 1050.1672 1061.1308 1070.9787 1090.2379 1099.6266 1106.5870 1140.4947 1148.8128 1179.1357 1187.3675 1197.8522 1206.1743 1218.2856 1224.2255 1244.4324 1260.2883 1263.0764 1266.3938 1290.9330 1297.0752 1307.9539 1333.6630 1350.4743 1359.3803 1390.8679 1398.5274 1404.0552 1427.8324 1448.2777 1462.2482 1462.6155 1464.8813 1465.2580 1477.7003 1479.0776 1480.3479 1481.0611 1481.9481 1497.8626 1582.9261 1602.6211 1610.3439 2837.4590 2844.3398 2858.0092 2989.5260 2990.4592 3012.4208 3014.3619 3022.7482 3030.6133 3035.8629 3042.1868 3069.1556 3074.1043 3076.8281 3087.4690 3088.2679 3092.9431 3093.8872 3122.5004 3134.5272 3156.6666
redmass: 3.0050 2.3466 2.2327 4.7104 5.3172 2.9264 3.9397 2.7419 1.5633 1.7494 1.0642 3.2878 2.9003 2.7266 4.1421 4.1072 3.4565 2.1756 4.1939 4.2260 3.7379 3.3201 4.9804 3.0204 4.4022 4.7121 2.5304 3.9033 4.8681 6.2655 1.8912 2.8803 1.2516 1.1956 3.5483 2.2656 2.1943 1.3129 2.5974 4.6127 3.2026 1.9662 1.5475 1.3505 1.5828 4.4585 1.6792 1.5780 1.8765 2.8724 2.1026 2.1251 1.6891 1.7847 2.2436 1.8857 1.1829 1.2874 1.3300 1.4285 2.6692 2.0843 1.2309 1.8940 2.7092 1.1612 1.2866 1.2863 1.3051 1.4526 1.4576 7.4911 1.5427 1.2184 1.2209 2.3713 1.8297 1.1008 1.0847 1.1107 1.0883 1.0845 1.1797 1.1851 1.0835 1.0850 1.0996 7.8400 5.7193 10.0578 1.0709 1.0722 1.0703 1.0363 1.0370 1.0601 1.0591 1.0666 1.0861 1.0870 1.0865 1.1040 1.0965 1.0973 1.1066 1.1018 1.1055 1.1003 1.0857 1.0918 1.0998
irintensity: 0.2108 0.1009 0.2317 0.2743 0.9251 1.1423 0.8780 0.1397 0.9332 4.3549 0.6798 0.9337 4.6171 0.0620 2.7506 8.4611 4.6517 7.7158 4.7911 2.6599 14.8157 5.1919 0.2540 1.5501 0.0502 2.3380 1.6840 0.4065 16.5330 3.4695 1.0572 4.0843 48.9289 1.5211 10.9470 4.4167 9.9420 0.2332 9.4235 6.7766 6.6353 1.6794 4.9270 0.3829 0.6121 242.3695 9.2410 0.4825 41.8672 32.6102 55.6468 2.8035 4.7546 39.9343 3.9152 49.4747 4.6237 0.7561 5.9972 3.9943 209.4264 48.2179 3.8107 11.7099 15.8625 11.3199 8.9836 2.0023 0.6199 4.0752 5.1617 2.6259 2.5246 15.3784 21.0152 40.1706 10.5894 18.0274 4.7817 8.1617 6.2969 9.2796 32.9869 20.0146 6.3478 3.7063 3.7581 23.3969 20.6971 181.6906 63.9119 44.8752 195.9066 35.6859 11.7275 21.1696 17.5186 55.8949 54.7836 14.8170 32.6806 7.1333 17.4470 16.0319 37.9715 15.6161 71.4710 18.5615 0.2297 26.2092 35.2630
temp: 298.150 k
press: 1.00000 atm
elementType: 8 8 7 6 6 6 6 6 6 6 6 6 6 6 6 6 6 6 1 1 1 1 1 1 1 1 1 1 1 1 1 1 1 1 1 1 1 1 1
symmnumber: 1
zpe: 865200.5 jmol-1
zpe.correction: 0.329537 hartree
zpe.thermalcorrener: 0.348374 hartree
zpe.thermalcorrenthalpy: 0.349319 hartree
zpe.thermalcorrgfe: 0.278476 hartree
zpe.sumelectzpe: -788.016536 hartree
zpe.sumelectthermal: -787.997699 hartree
zpe.sumelectthermalent: -787.996755 hartree
zpe.sumelectthermalfe: -788.067598 hartree
dipole: 1.2546 -2.1344 -0.5942
dipole: 2.5461
quadrupole: -91.2349 -106.8318 -110.7516
quadrupole: -0.7854 4.3589 -3.9913
quadrupole: 11.7046 -3.8924 -7.8122 -0.7854 4.3589 -3.9913
hfenergy: -788.3460736 hartree
pointgroup: C01 [X(C15H21N1O2)]
dipole: -0.446095 -0.5469476 0.7108325 debye
polarizability: 233.9710538|9.4703747|154.4979183|11.897206|-24.5667356|139.0634694 unknown
InChI: InChI=1S/C15H21NO2/c1-12-6-5-7-13(2)14(12)15(17)18-11-10-16-8-3-4-9-16/h5-7H,3-4,8-11H2,1-2H3
charge 0 multiplicity 1
39 atoms
O  -0.022342 0.172347 0.129362
O  0.786247 0.893113 -1.923549
N  -3.754318 0.113917 0.330164
C  -4.727054 -0.068896 1.438599
C  -4.267195 -0.71898 -0.794623
C  -6.088034 0.020272 0.716117
C  -5.819225 -0.6332 -0.679139
C  -2.349435 -0.127382 0.702809
C  -1.404222 0.379927 -0.391233
C  2.371085 0.226624 -0.168592
C  1.016084 0.459715 -0.766359
C  3.383461 1.213268 -0.402785
C  2.659434 -0.962753 0.573572
C  4.672887 1.001195 0.141769
C  3.970147 -1.138309 1.081691
C  3.119029 2.481014 -1.197444
C  1.635137 -2.059239 0.820416
C  4.969166 -0.164477 0.877986
H  -4.589387 0.711021 2.208715
H  -4.614256 -1.068157 1.934133
H  -3.929733 -1.782336 -0.692176
H  -3.894512 -0.342073 -1.763497
H  -6.372628 1.079277 0.592945
H  -6.890887 -0.488764 1.277094
H  -6.267907 -1.639609 -0.748186
H  -6.252284 -0.022426 -1.489056
H  -2.139369 -1.211556 0.896373
H  -2.132038 0.422843 1.636701
H  -1.562432 1.454697 -0.588097
H  -1.511592 -0.169882 -1.343156
H  5.448211 1.758657 -0.019633
H  4.203688 -2.0517 1.640759
H  3.988292 3.158172 -1.143588
H  2.912195 2.249318 -2.256316
H  2.233406 3.026838 -0.823964
H  2.131664 -2.966032 1.206402
H  0.876141 -1.734945 1.553107
H  1.088615 -2.332345 -0.099836
H  5.974961 -0.316254 1.285614
