program: Orca
programVersion: 5.0.2
elementType: P O O O O N C C C C C H H H H H H H H H H H H
charge: 0
multiplicity: 1
keywords: wb97x-d3
keywords: def2-TZVPP
keywords: def2/J RIJCOSX
keywords: DEFGRID2
keywords: scfconv7
keywords: smallprint printgap noloewdin
keywords: NOSOSCF
formula: C5H12NO4P
InChI: InChI=1/C5H12NO4P/c1-11(9,10)3-2-4(6)5(7)8/h4,7,9H,2-3,6H2,1H3
23 atoms
P  2.005646 -0.089204 0.005083
O  1.796559 -0.191459 -1.585824
O  1.92722 1.27034 0.604877
O  -3.202301 1.397753 -0.270072
O  -3.538073 -0.477508 0.886528
N  -0.751624 0.713203 -1.136508
C  0.74352 -1.20392 0.728744
C  -0.601724 -0.530749 0.997159
C  -1.433779 -0.21421 -0.252262
C  3.589711 -0.933056 0.208478
C  -2.832693 0.202767 0.195846
H  0.624946 -2.094943 0.106318
H  1.139948 -1.548842 1.687766
H  -0.433978 0.387473 1.566702
H  -1.198377 -1.186836 1.630536
H  -1.578073 -1.152498 -0.800904
H  4.365484 -0.377065 -0.316514
H  3.854503 -0.968832 1.264068
H  3.562755 -1.947584 -0.186657
H  -1.340279 0.989682 -1.911177
H  -0.482206 1.557658 -0.642944
H  0.875959 0.128569 -1.750758
H  -4.094162 1.585204 0.052707
totalener: -894.96407148 hartree
nucrepener: 796.20495306 hartree
electener: -1691.16902454 hartree
oneelecener: -2810.71574794 hartree
twoeener: 1119.54672340 hartree
kineticenergy: 891.90500622 hartree
xcener: -67.834357649738 hartree
chargesum: -0.0000000
charge: 0.723590 -0.396843 -0.569206 -0.270782 -0.340890 -0.318640 -0.246555 -0.174553 0.062652 -0.329049 0.320191 0.093849 0.099725 0.106185 0.108837 0.096453 0.114508 0.105922 0.104152 0.128180 0.152003 0.223842 0.206427
qa: 0.7236 -0.3968 -0.5692 -0.2708 -0.3409 -0.3186 -0.2466 -0.1746 0.0627 -0.3290 0.3202 0.0938 0.0997 0.1062 0.1088 0.0965 0.1145 0.1059 0.1042 0.1282 0.1520 0.2238 0.2064
va: 5.1486 2.0823 2.0391 2.2037 2.1564 3.0798 3.8397 3.9359 3.8256 3.8793 4.2916 1.0177 1.0083 1.0242 1.0247 1.0163 1.0209 1.0111 1.0107 1.0367 1.0358 1.1003 1.0430
dispcorr: -0.009913311 hartree
energy: -894.973984791541
dipole: 2.99898 -3.76479 -0.76582 -4.36495 3.80216 -0.56279 0.54369 -0.98159 -0.43789
magnitude: 1.04641 au
magnitude: 2.65975 debye
