program: Orca
programVersion: 5.0.2
elementType: P O O O O O O N N N C C C C C C C C C C C H H H H H H H H H H H H H H H H H H H H H H
charge: 0
multiplicity: 1
keywords: wb97x-d3
keywords: def2-TZVPP
keywords: def2/J RIJCOSX
keywords: DEFGRID2
keywords: scfconv7
keywords: smallprint printgap noloewdin
keywords: NOSOSCF
formula: C11H22N3O6P
InChI: InChI=1/C11H22N3O6P/c1-6(9(15)14-7(2)11(17)18)13-10(16)8(12)4-5-21(3,19)20/h6-8,13-14,17,19H,4-5,12H2,1-3H3
43 atoms
P  2.90348 -1.407643 0.517812
O  2.542606 0.057376 -0.025149
O  2.218101 -1.778253 1.814453
O  -1.817946 -1.640691 -0.762373
O  0.111569 0.968045 -0.451459
O  -2.233108 5.192916 -1.010715
O  -2.829641 4.173463 0.885023
N  -0.51838 -1.319591 1.04485
N  -0.66406 -4.225094 -1.106994
N  -1.937009 1.777814 0.020335
C  1.149792 -2.595899 -1.401452
C  0.047194 -3.139344 -0.46182
C  2.56474 -2.578231 -0.825397
C  -0.858551 -1.978001 -0.070565
C  -1.113031 -0.047989 1.365396
C  4.68911 -1.323739 0.675162
C  -0.929836 0.931835 0.21149
C  -0.452562 0.534426 2.609383
C  -1.920639 2.864307 -0.928234
C  -2.780668 2.558782 -2.153603
C  -2.378191 4.131642 -0.232911
H  1.173798 -3.246216 -2.276981
H  0.89511 -1.604278 -1.783304
H  0.511987 -3.543125 0.440471
H  3.268862 -2.34135 -1.627406
H  2.83903 -3.570987 -0.45758
H  -2.181138 -0.174751 1.560654
H  0.357056 -1.565465 1.507089
H  5.076118 -2.305115 0.948184
H  4.961175 -0.616488 1.458868
H  5.157997 -1.014548 -0.25809
H  -1.141637 -3.865564 -1.925603
H  -1.393545 -4.561566 -0.48898
H  -0.905136 1.489716 2.869338
H  -0.584899 -0.138856 3.455582
H  0.615409 0.691144 2.45645
H  -0.890138 3.020665 -1.250976
H  -2.772517 1.65668 0.574783
H  1.578221 0.283779 -0.132994
H  -2.713985 3.354018 -2.893765
H  -2.429543 1.639036 -2.61869
H  -3.827478 2.427419 -1.878767
H  -2.549661 5.989926 -0.55616
elementType: P O N C H
totalener: -1389.73720788 hartree
nucrepener: 2068.27000375 hartree
electener: -3458.00721163 hartree
oneelecener: -6019.10333295 hartree
twoeener: 2561.09612132 hartree
cpcmener: -0.06866794 hartree
kineticenergy: 1384.42864070 hartree
xcener: -114.435334485516 hartree
chargesum: 0.0000000
charge: 0.775183 -0.477220 -0.725328 -0.567508 -0.550442 -0.300078 -0.457390 -0.256517 -0.399416 -0.152670 -0.169993 0.188994 -0.186800 0.248796 0.102818 -0.320353 0.360330 -0.288019 0.102956 -0.277217 0.414741 0.089370 0.096612 0.089530 0.119904 0.110782 0.103674 0.219669 0.121547 0.124270 0.121642 0.139282 0.142677 0.103713 0.116558 0.095606 0.100960 0.179027 0.276623 0.104729 0.102324 0.107260 0.269376
qa: 0.7752 -0.4772 -0.7253 -0.5675 -0.5504 -0.3001 -0.4574 -0.2565 -0.3994 -0.1527 -0.1700 0.1890 -0.1868 0.2488 0.1028 -0.3204 0.3603 -0.2880 0.1030 -0.2772 0.4147 0.0894 0.0966 0.0895 0.1199 0.1108 0.1037 0.2197 0.1215 0.1243 0.1216 0.1393 0.1427 0.1037 0.1166 0.0956 0.1010 0.1790 0.2766 0.1047 0.1023 0.1073 0.2694
va: 4.9922 2.0474 1.8258 1.9400 1.9505 2.2012 2.0278 3.1603 3.0691 3.3214 3.8634 3.7357 3.8375 4.2840 3.8932 3.9147 3.9941 3.9370 3.7827 3.9484 4.2298 1.0252 1.0231 1.0382 1.0088 1.0158 1.0210 1.0368 1.0052 1.0154 1.0072 1.0335 1.0190 1.0151 1.0022 1.0166 1.0472 1.0176 1.0663 1.0141 1.0060 0.9998 0.9843
dispcorr: -0.024696859 hartree
energy: -1389.761904735337
dipole: 2.37590 -2.46737 -0.09147 -6.12602 7.49125 1.36523 -3.47454 2.83854 -0.63600
magnitude: 1.50888 au
magnitude: 3.83528 debye
