program: Orca
programVersion: 5.0.2
elementType: P O O O O O O N N N C C C C C C C C C C C H H H H H H H H H H H H H H H H H H H H H H
charge: 0
multiplicity: 1
keywords: wb97x-d3
keywords: def2-TZVPP
keywords: def2/J RIJCOSX
keywords: DEFGRID2
keywords: scfconv7
keywords: smallprint printgap noloewdin
keywords: NOSOSCF
formula: C11H22N3O6P
InChI: InChI=1/C11H22N3O6P/c1-6(9(15)14-7(2)11(17)18)13-10(16)8(12)4-5-21(3,19)20/h6-8,13-14,17,19H,4-5,12H2,1-3H3
43 atoms
P  2.289658 -0.19145 0.634652
O  2.86219 1.191709 0.024071
O  1.083507 -0.004961 1.521762
O  -1.086693 -2.263844 -1.474237
O  -3.227573 1.302144 -0.903989
O  -0.416461 4.029053 -1.844744
O  0.645763 2.073212 -1.716645
N  -1.55174 -1.500347 0.596833
N  -0.009128 -4.357071 0.365059
N  -1.260817 1.254726 0.204075
C  1.631886 -2.697372 -0.524515
C  0.370305 -2.951676 0.301255
C  1.984576 -1.237808 -0.808647
C  -0.814118 -2.196816 -0.2786
C  -2.709216 -0.727902 0.222989
C  3.716247 -0.836149 1.507509
C  -2.397612 0.696708 -0.231509
C  -3.69412 -0.66603 1.385705
C  -0.977711 2.650946 -0.020372
C  -0.213229 3.260589 1.153993
C  -0.170408 2.858518 -1.286172
H  2.467664 -3.189008 -0.020294
H  1.520993 -3.199174 -1.489027
H  0.537227 -2.62309 1.32765
H  1.202541 -0.749451 -1.396922
H  2.889207 -1.203313 -1.420131
H  -3.195155 -1.219529 -0.620192
H  -1.245079 -1.457861 1.557922
H  4.010706 -0.15155 2.303082
H  4.560073 -0.983786 0.834884
H  3.460306 -1.794041 1.959878
H  0.728682 -4.862731 0.841217
H  -0.034619 -4.731464 -0.577232
H  -4.010745 -1.67075 1.662558
H  -3.247321 -0.191999 2.260761
H  -4.58114 -0.100088 1.107685
H  -1.922192 3.184446 -0.124421
H  -0.555497 0.702884 0.690632
H  2.221995 1.615105 -0.575537
H  -0.796517 3.1511 2.066781
H  0.755055 2.785056 1.301602
H  -0.047771 4.323982 0.988364
H  0.167396 4.17309 -2.607001
elementType: P O N C H
totalener: -1389.73609564 hartree
nucrepener: 2138.44743366 hartree
electener: -3528.18352930 hartree
oneelecener: -6159.06817590 hartree
twoeener: 2630.88464660 hartree
cpcmener: -0.07604883 hartree
kineticenergy: 1384.41871328 hartree
xcener: -114.428273851989 hartree
chargesum: -0.0000000
charge: 0.781458 -0.465308 -0.714087 -0.568242 -0.570370 -0.289420 -0.479654 -0.181107 -0.386139 -0.229081 -0.238498 0.172481 -0.182741 0.296083 0.101936 -0.307988 0.353795 -0.275142 0.071153 -0.272025 0.435603 0.107310 0.095786 0.072701 0.102411 0.132880 0.087333 0.182955 0.131881 0.127752 0.124630 0.144760 0.144164 0.107444 0.104836 0.099795 0.095435 0.216666 0.283134 0.110820 0.092605 0.109991 0.272000
qa: 0.7815 -0.4653 -0.7141 -0.5682 -0.5704 -0.2894 -0.4797 -0.1811 -0.3861 -0.2291 -0.2385 0.1725 -0.1827 0.2961 0.1019 -0.3080 0.3538 -0.2751 0.0712 -0.2720 0.4356 0.1073 0.0958 0.0727 0.1024 0.1329 0.0873 0.1830 0.1319 0.1278 0.1246 0.1448 0.1442 0.1074 0.1048 0.0998 0.0954 0.2167 0.2831 0.1108 0.0926 0.1100 0.2720
va: 4.9503 2.0796 1.8418 1.9367 1.9412 2.2304 1.9875 3.2052 3.0371 3.1705 3.9780 3.8230 3.7952 4.1975 3.8086 3.9105 4.1300 3.9313 3.8243 3.9300 4.1264 1.0040 1.0216 1.0521 1.0481 1.0114 1.0503 1.0067 1.0137 1.0065 1.0047 1.0168 1.0287 1.0061 1.0019 1.0154 1.0492 1.0420 1.0122 1.0045 1.0230 1.0113 0.9825
dispcorr: -0.026884096 hartree
energy: -1389.762979733280
dipole: 2.84111 0.48225 3.32336 -7.47029 7.51146 0.04117 9.25860 -7.56312 1.69549
magnitude: 3.73110 au
magnitude: 9.48370 debye
