program: Orca
programVersion: 5.0.2
elementType: P O O O O O O N N N C C C C C C C C C C C H H H H H H H H H H H H H H H H H H H H H H
charge: 0
multiplicity: 1
keywords: wb97x-d3
keywords: def2-TZVPP
keywords: def2/J RIJCOSX
keywords: DEFGRID2
keywords: scfconv7
keywords: smallprint printgap noloewdin
keywords: NOSOSCF
formula: C11H22N3O6P
InChI: InChI=1/C11H22N3O6P/c1-6(9(15)14-7(2)11(17)18)13-10(16)8(12)4-5-21(3,19)20/h6-8,13-14,17,19H,4-5,12H2,1-3H3
43 atoms
P  2.920688 -0.068837 -0.146496
O  3.00132 0.85032 -1.467173
O  2.546654 0.737667 1.087425
O  -0.857992 -1.001014 1.606752
O  -1.466364 0.250093 -1.569795
O  0.213466 1.784818 0.95653
O  0.682297 2.523283 -1.103039
N  -2.072155 -1.994248 -0.006689
N  -0.176925 -3.788533 -0.567481
N  -2.397638 1.490492 0.039151
C  1.457346 -2.31446 0.671076
C  0.072846 -2.97565 0.607894
C  1.709898 -1.361199 -0.502797
C  -0.997682 -1.902855 0.78337
C  -3.012844 -0.898749 -0.154128
C  4.545036 -0.807925 -0.046229
C  -2.226101 0.334733 -0.608155
C  -3.935458 -0.711485 1.039237
C  -1.587713 2.644113 -0.301967
C  -1.930271 3.811543 0.610757
C  -0.10391 2.299977 -0.198833
H  1.554307 -1.794945 1.624763
H  2.214849 -3.100105 0.672989
H  -0.0158 -3.628896 1.481164
H  0.799934 -0.830231 -0.797838
H  2.044589 -1.902006 -1.391052
H  -3.636655 -1.161027 -1.011441
H  -2.063888 -2.733444 -0.694445
H  4.56873 -1.515107 0.782822
H  5.302099 -0.04349 0.125473
H  4.779615 -1.344256 -0.965043
H  0.355442 -4.646007 -0.498591
H  0.154236 -3.313431 -1.399958
H  -4.450506 -1.647632 1.249778
H  -3.411793 -0.406688 1.943618
H  -4.701711 0.031214 0.815344
H  -1.779925 2.932297 -1.336778
H  -2.941261 1.521253 0.888874
H  2.256811 1.486545 -1.496644
H  -2.972102 4.099842 0.47575
H  -1.774913 3.562464 1.660301
H  -1.312619 4.675033 0.368252
H  1.167029 1.432375 1.006727
elementType: P O N C H
totalener: -1389.73789221 hartree
nucrepener: 2164.89719047 hartree
electener: -3554.63508268 hartree
oneelecener: -6213.97433891 hartree
twoeener: 2659.33925623 hartree
cpcmener: -0.07824851 hartree
kineticenergy: 1384.42482004 hartree
xcener: -114.443671999807 hartree
chargesum: -0.0000000
charge: 0.782887 -0.458303 -0.676276 -0.570885 -0.554955 -0.372390 -0.508478 -0.183344 -0.396469 -0.178770 -0.200590 0.221621 -0.209831 0.232028 0.135984 -0.297176 0.305652 -0.308110 0.122882 -0.294412 0.418721 0.082907 0.109453 0.105823 0.106568 0.129625 0.107643 0.179441 0.130404 0.129725 0.128642 0.141323 0.160727 0.100846 0.097962 0.113059 0.092282 0.191397 0.279953 0.114092 0.103698 0.108747 0.275899
qa: 0.7829 -0.4583 -0.6763 -0.5709 -0.5550 -0.3724 -0.5085 -0.1833 -0.3965 -0.1788 -0.2006 0.2216 -0.2098 0.2320 0.1360 -0.2972 0.3057 -0.3081 0.1229 -0.2944 0.4187 0.0829 0.1095 0.1058 0.1066 0.1296 0.1076 0.1794 0.1304 0.1297 0.1286 0.1413 0.1607 0.1008 0.0980 0.1131 0.0923 0.1914 0.2800 0.1141 0.1037 0.1087 0.2759
va: 4.9387 2.0838 1.8760 1.9253 1.9515 2.1224 1.9881 3.1679 3.0640 3.2362 3.9007 3.8940 3.7689 4.2079 3.8606 3.9045 4.1277 3.9225 3.8358 3.9504 4.0985 1.0520 1.0089 1.0138 1.0358 1.0217 1.0084 1.0464 1.0055 1.0142 1.0054 1.0187 1.0179 1.0088 1.0163 1.0031 1.0326 0.9986 1.0281 1.0021 1.0079 1.0046 1.0722
dispcorr: -0.026852510 hartree
energy: -1389.764744715244
dipole: -7.13343 6.02017 -1.11326 -7.02613 4.36310 -2.66303 3.00926 -3.35252 -0.34326
magnitude: 2.90670 au
magnitude: 7.38824 debye
