program: Orca
programVersion: 5.0.2
elementType: P O O O O O O N N N C C C C C C C C C C C H H H H H H H H H H H H H H H H H H H H H H
charge: 0
multiplicity: 1
keywords: wb97x-d3
keywords: def2-TZVPP
keywords: def2/J RIJCOSX
keywords: DEFGRID2
keywords: scfconv7
keywords: smallprint printgap noloewdin
keywords: NOSOSCF
formula: C11H22N3O6P
InChI: InChI=1/C11H22N3O6P/c1-6(9(15)14-7(2)11(17)18)13-10(16)8(12)4-5-21(3,19)20/h6-8,13-14,17,19H,4-5,12H2,1-3H3
43 atoms
P  2.316083 -0.158801 0.571603
O  2.891862 1.22898 -0.025129
O  1.120894 0.02639 1.473158
O  -1.116456 -2.085709 -1.44963
O  -3.290966 1.285704 -0.789141
O  -0.506289 3.980343 -1.958142
O  0.640561 2.080745 -1.746447
N  -1.523439 -1.473705 0.679824
N  0.108467 -4.327561 0.228294
N  -1.261016 1.276856 0.203896
C  1.630516 -2.643959 -0.618006
C  0.394764 -2.900366 0.238549
C  1.990115 -1.18405 -0.883421
C  -0.801207 -2.099245 -0.261207
C  -2.702159 -0.700455 0.381674
C  3.745505 -0.828962 1.421572
C  -2.421433 0.705974 -0.144822
C  -3.576661 -0.589896 1.626046
C  -0.993407 2.668735 -0.064151
C  -0.215019 3.314324 1.081494
C  -0.204897 2.850395 -1.345651
H  2.473667 -3.153748 -0.148107
H  1.48767 -3.122357 -1.59024
H  0.607925 -2.621852 1.271987
H  1.209929 -0.682619 -1.461923
H  2.892228 -1.150196 -1.499048
H  -3.267497 -1.212293 -0.398133
H  -1.17652 -1.465189 1.628124
H  4.582442 -0.973079 0.739587
H  3.484866 -1.792135 1.859974
H  4.05292 -0.160667 2.226086
H  -0.176822 -4.603352 -0.704768
H  -0.676537 -4.523657 0.837707
H  -4.471438 -0.007613 1.414804
H  -3.890702 -1.579735 1.954419
H  -3.041938 -0.108185 2.445833
H  -1.943902 3.191041 -0.168231
H  -0.537391 0.740905 0.681441
H  2.246034 1.663373 -0.610423
H  0.749269 2.833381 1.239415
H  -0.039122 4.369229 0.875728
H  -0.793165 3.244163 2.001349
H  0.065428 4.112123 -2.731686
elementType: P O N C H
totalener: -1389.73712932 hartree
nucrepener: 2141.29343252 hartree
electener: -3531.03056185 hartree
oneelecener: -6164.69005849 hartree
twoeener: 2633.65949665 hartree
cpcmener: -0.07394572 hartree
kineticenergy: 1384.41093954 hartree
xcener: -114.427000551740 hartree
chargesum: 0.0000000
charge: 0.781805 -0.465014 -0.713324 -0.569423 -0.568738 -0.288952 -0.480510 -0.183594 -0.397955 -0.226598 -0.226868 0.218414 -0.179932 0.248348 0.097881 -0.307459 0.349095 -0.276744 0.068052 -0.270502 0.439141 0.102098 0.097500 0.076531 0.103511 0.132900 0.090045 0.183789 0.127646 0.124689 0.131801 0.145274 0.145705 0.099650 0.109315 0.104523 0.093854 0.216100 0.283220 0.092357 0.109984 0.110464 0.271926
qa: 0.7818 -0.4650 -0.7133 -0.5694 -0.5687 -0.2890 -0.4805 -0.1836 -0.3980 -0.2266 -0.2269 0.2184 -0.1799 0.2483 0.0979 -0.3075 0.3491 -0.2767 0.0681 -0.2705 0.4391 0.1021 0.0975 0.0765 0.1035 0.1329 0.0900 0.1838 0.1276 0.1247 0.1318 0.1453 0.1457 0.0997 0.1093 0.1045 0.0939 0.2161 0.2832 0.0924 0.1100 0.1105 0.2719
va: 4.9504 2.0802 1.8439 1.9314 1.9431 2.2293 1.9879 3.2001 3.0299 3.1643 3.9475 3.7676 3.7938 4.2138 3.8201 3.9114 4.1184 3.9322 3.8247 3.9308 4.1264 1.0126 1.0186 1.0434 1.0505 1.0123 1.0460 1.0068 1.0065 1.0045 1.0137 1.0257 1.0186 1.0152 1.0054 1.0019 1.0510 1.0425 1.0110 1.0232 1.0107 1.0046 0.9825
dispcorr: -0.027036368 hartree
energy: -1389.764165689418
dipole: 1.75304 0.38262 2.13566 -7.09311 7.28708 0.19397 9.38894 -7.64491 1.74403
magnitude: 2.76412 au
magnitude: 7.02582 debye
