program: Orca
programVersion: 5.0.2
elementType: P O O O O O O N N N C C C C C C C C C C C H H H H H H H H H H H H H H H H H H H H H H
charge: 0
multiplicity: 1
keywords: wb97x-d3
keywords: def2-TZVPP
keywords: def2/J RIJCOSX
keywords: DEFGRID2
keywords: scfconv7
keywords: smallprint printgap noloewdin
keywords: NOSOSCF
formula: C11H22N3O6P
InChI: InChI=1/C11H22N3O6P/c1-6(9(15)14-7(2)11(17)18)13-10(16)8(12)4-5-21(3,19)20/h6-8,13-14,17,19H,4-5,12H2,1-3H3
43 atoms
P  2.857082 -1.254227 0.521288
O  2.426692 0.169422 -0.080436
O  2.214499 -1.581239 1.850516
O  -1.907958 -1.845641 -0.59507
O  -0.054287 0.943563 -0.510264
O  -1.13366 3.90704 0.480045
O  -1.785304 4.965788 -1.372136
N  -0.581875 -1.279217 1.13052
N  -0.569651 -4.35807 -0.775907
N  -2.183247 1.59032 -0.196872
C  1.09723 -2.618029 -1.262851
C  0.071991 -3.172456 -0.244315
C  2.532567 -2.502462 -0.754338
C  -0.90656 -2.053925 0.086935
C  -1.247845 -0.020386 1.351066
C  4.641967 -1.10026 0.625037
C  -1.112139 0.868543 0.120876
C  -0.623084 0.694481 2.542413
C  -2.190893 2.608474 -1.218567
C  -3.578541 2.739066 -1.8295
C  -1.69224 3.95583 -0.716445
H  1.113396 -3.303943 -2.111047
H  0.775593 -1.657265 -1.672314
H  0.594346 -3.466438 0.668231
H  3.189482 -2.266492 -1.595585
H  2.87348 -3.461501 -0.354599
H  -2.307226 -0.190424 1.557738
H  0.320831 -1.426832 1.580864
H  5.069624 -2.050818 0.942911
H  4.909405 -0.34018 1.3591
H  5.074989 -0.830808 -0.337255
H  -1.106169 -4.103636 -1.597919
H  -1.245023 -4.702022 -0.103033
H  -1.114471 1.650124 2.717488
H  -0.7359 0.091437 3.442525
H  0.439454 0.879354 2.381871
H  -1.494839 2.310164 -2.007171
H  -3.014422 1.492584 0.370179
H  1.451903 0.347448 -0.172989
H  -3.881973 1.787029 -2.260961
H  -4.318799 3.033569 -1.084772
H  -3.58015 3.479563 -2.625612
H  -0.814663 4.787482 0.735584
elementType: P O N C H
totalener: -1389.73695520 hartree
nucrepener: 2085.40905841 hartree
electener: -3475.14601361 hartree
oneelecener: -6053.16225145 hartree
twoeener: 2578.01623783 hartree
cpcmener: -0.07317981 hartree
kineticenergy: 1384.43984098 hartree
xcener: -114.436929372772 hartree
chargesum: 0.0000000
charge: 0.774251 -0.475939 -0.725308 -0.565287 -0.549723 -0.273955 -0.468589 -0.258321 -0.400144 -0.153352 -0.173872 0.186150 -0.186179 0.250897 0.116218 -0.319010 0.335665 -0.284542 0.100749 -0.265622 0.410027 0.090254 0.097276 0.090520 0.120013 0.111531 0.103331 0.218731 0.121549 0.124182 0.121817 0.139365 0.142743 0.100915 0.117765 0.095659 0.103616 0.187380 0.276296 0.107458 0.107408 0.092730 0.255349
qa: 0.7743 -0.4759 -0.7253 -0.5653 -0.5497 -0.2740 -0.4686 -0.2583 -0.4001 -0.1534 -0.1739 0.1862 -0.1862 0.2509 0.1162 -0.3190 0.3357 -0.2845 0.1007 -0.2656 0.4100 0.0903 0.0973 0.0905 0.1200 0.1115 0.1033 0.2187 0.1215 0.1242 0.1218 0.1394 0.1427 0.1009 0.1178 0.0957 0.1036 0.1874 0.2763 0.1075 0.1074 0.0927 0.2553
va: 4.9947 2.0481 1.8268 1.9449 1.9502 2.2103 2.0302 3.1671 3.0675 3.2892 3.8679 3.7308 3.8341 4.2892 3.8612 3.9135 4.0163 3.9447 3.7578 3.9548 4.2075 1.0242 1.0231 1.0407 1.0093 1.0154 1.0249 1.0371 1.0052 1.0154 1.0072 1.0334 1.0187 1.0154 1.0025 1.0171 1.0291 1.0019 1.0655 1.0063 0.9982 1.0186 0.9954
dispcorr: -0.024970538 hartree
energy: -1389.761925736945
dipole: -0.75972 0.42042 -0.33930 -5.89769 6.39454 0.49685 -0.55962 1.37751 0.81789
magnitude: 1.01534 au
magnitude: 2.58079 debye
