program: Orca
programVersion: 5.0.2
elementType: P O O O O O O N N N C C C C C C C C C C C H H H H H H H H H H H H H H H H H H H H H H
charge: 0
multiplicity: 1
keywords: wb97x-d3
keywords: def2-TZVPP
keywords: def2/J RIJCOSX
keywords: DEFGRID2
keywords: scfconv7
keywords: smallprint printgap noloewdin
keywords: NOSOSCF
formula: C11H22N3O6P
InChI: InChI=1/C11H22N3O6P/c1-6(9(15)14-7(2)11(17)18)13-10(16)8(12)4-5-21(3,19)20/h6-8,13-14,17,19H,4-5,12H2,1-3H3
43 atoms
P  2.318395 -0.163125 0.58002
O  2.856532 1.231445 -0.034148
O  1.135543 0.004042 1.501156
O  -1.105909 -2.108092 -1.443946
O  -3.233338 1.292864 -0.82776
O  -0.575209 3.947708 -1.978759
O  0.674683 2.11983 -1.730897
N  -1.523827 -1.479486 0.677901
N  0.107698 -4.34131 0.255692
N  -1.233488 1.272777 0.220632
C  1.631518 -2.65855 -0.593624
C  0.392787 -2.914097 0.258655
C  1.98498 -1.198566 -0.866458
C  -0.798456 -2.114617 -0.253804
C  -2.691417 -0.696085 0.363104
C  3.77431 -0.80275 1.408359
C  -2.387116 0.706868 -0.158791
C  -3.584247 -0.577238 1.593288
C  -0.963376 2.666285 -0.039523
C  -0.155689 3.297053 1.092851
C  -0.205574 2.855331 -1.338417
H  2.47502 -3.161894 -0.117565
H  1.494303 -3.143491 -1.563486
H  0.600296 -2.6291 1.291223
H  1.1988 -0.700934 -1.440313
H  2.881404 -1.163411 -1.489803
H  -3.249482 -1.202721 -0.425113
H  -1.185061 -1.467397 1.628913
H  4.604685 -0.926003 0.714421
H  3.541858 -1.772534 1.847961
H  4.077243 -0.12881 2.20986
H  -0.175812 -4.622914 -0.676049
H  -0.678193 -4.534197 0.865035
H  -3.059267 -0.099818 2.421728
H  -4.470593 0.01233 1.36734
H  -3.911843 -1.564322 1.916375
H  -1.912972 3.194717 -0.114844
H  -0.519857 0.734922 0.710779
H  2.185583 1.652687 -0.604336
H  0.024724 4.351364 0.887206
H  -0.715687 3.228591 2.024038
H  0.80735 2.808206 1.22956
H  -0.025552 4.084643 -2.767188
elementType: P O N C H
totalener: -1389.73748120 hartree
nucrepener: 2142.62792515 hartree
electener: -3532.36540635 hartree
oneelecener: -6167.30928992 hartree
twoeener: 2634.94388357 hartree
cpcmener: -0.07345115 hartree
kineticenergy: 1384.41985644 hartree
xcener: -114.429212703964 hartree
chargesum: 0.0000000
charge: 0.781356 -0.468580 -0.714366 -0.569161 -0.567536 -0.286100 -0.478988 -0.184533 -0.398141 -0.229025 -0.225272 0.218041 -0.177938 0.248958 0.099217 -0.307479 0.349990 -0.276396 0.070937 -0.271882 0.435614 0.101278 0.096999 0.076549 0.101850 0.132858 0.089965 0.183757 0.126912 0.124729 0.131387 0.145188 0.145707 0.104470 0.099946 0.109198 0.093063 0.217421 0.283287 0.110795 0.111334 0.092319 0.272271
qa: 0.7814 -0.4686 -0.7144 -0.5692 -0.5675 -0.2861 -0.4790 -0.1845 -0.3981 -0.2290 -0.2253 0.2180 -0.1779 0.2490 0.0992 -0.3075 0.3500 -0.2764 0.0709 -0.2719 0.4356 0.1013 0.0970 0.0765 0.1018 0.1329 0.0900 0.1838 0.1269 0.1247 0.1314 0.1452 0.1457 0.1045 0.0999 0.1092 0.0931 0.2174 0.2833 0.1108 0.1113 0.0923 0.2723
va: 4.9527 2.0775 1.8423 1.9319 1.9433 2.2322 1.9902 3.2005 3.0300 3.1654 3.9469 3.7678 3.7953 4.2163 3.8226 3.9107 4.1147 3.9325 3.8260 3.9333 4.1227 1.0131 1.0188 1.0443 1.0502 1.0123 1.0469 1.0067 1.0066 1.0047 1.0137 1.0257 1.0185 1.0020 1.0147 1.0054 1.0499 1.0413 1.0173 1.0095 1.0044 1.0241 0.9822
dispcorr: -0.027061989 hartree
energy: -1389.764543185303
dipole: 1.73103 0.25881 1.98984 -7.05355 7.26123 0.20767 9.36843 -7.62814 1.74028
magnitude: 2.65164 au
magnitude: 6.73993 debye
