program: Orca
programVersion: 5.0.2
elementType: P O O O O O O N N N C C C C C C C C C C C H H H H H H H H H H H H H H H H H H H H H H
charge: 0
multiplicity: 1
keywords: wb97x-d3
keywords: def2-TZVPP
keywords: def2/J RIJCOSX
keywords: DEFGRID2
keywords: scfconv7
keywords: smallprint printgap noloewdin
keywords: NOSOSCF
formula: C11H22N3O6P
InChI: InChI=1/C11H22N3O6P/c1-6(9(15)14-7(2)11(17)18)13-10(16)8(12)4-5-21(3,19)20/h6-8,13-14,17,19H,4-5,12H2,1-3H3
43 atoms
P  2.84765 -1.42249 1.057966
O  2.609056 0.130818 0.74717
O  1.890284 -2.018392 2.062177
O  -1.481212 -1.34948 -1.224287
O  0.286937 1.168706 0.062788
O  -2.691952 4.91134 -1.463952
O  -3.88162 3.522569 -0.183375
N  -0.591013 -1.399047 0.840584
N  -0.189542 -3.806932 -1.840262
N  -1.882277 1.741712 -0.041057
C  1.586339 -2.171604 -1.394296
C  0.329474 -2.891372 -0.84529
C  2.84631 -2.289638 -0.53798
C  -0.678267 -1.824873 -0.427198
C  -1.284083 -0.209088 1.265571
C  4.551081 -1.435716 1.627973
C  -0.890965 0.954897 0.361436
C  -0.91772 0.125117 2.705005
C  -1.68871 2.860374 -0.933095
C  -1.513998 2.408904 -2.385388
C  -2.879053 3.785875 -0.798347
H  1.814839 -2.624803 -2.360473
H  1.382198 -1.118537 -1.605358
H  0.607813 -3.484236 0.030055
H  3.695689 -1.898304 -1.105085
H  3.070222 -3.340952 -0.334394
H  -2.364751 -0.366957 1.203684
H  0.172772 -1.745233 1.423971
H  4.628343 -0.90655 2.578326
H  5.220688 -0.965423 0.908497
H  4.876441 -2.464609 1.782857
H  -0.529133 -3.281648 -2.638435
H  -0.994907 -4.296638 -1.467909
H  0.150197 0.316113 2.81355
H  -1.458567 1.009571 3.039426
H  -1.186909 -0.700392 3.363965
H  -0.79872 3.4132 -0.620821
H  -2.831332 1.468875 0.17268
H  1.682588 0.413102 0.514084
H  -2.405636 1.894255 -2.744717
H  -1.31245 3.255439 -3.039866
H  -0.670249 1.725105 -2.461719
H  -3.47665 5.47838 -1.397041
elementType: P O N C H
totalener: -1389.73550836 hartree
nucrepener: 2078.16918949 hartree
electener: -3467.90469785 hartree
oneelecener: -6038.76517406 hartree
twoeener: 2570.86047621 hartree
cpcmener: -0.05321048 hartree
kineticenergy: 1384.44235082 hartree
xcener: -114.434398989624 hartree
chargesum: 0.0000000
charge: 0.760694 -0.464795 -0.693258 -0.533131 -0.536466 -0.290574 -0.433275 -0.256502 -0.394389 -0.146014 -0.168022 0.186244 -0.193349 0.227933 0.101023 -0.321462 0.347969 -0.287195 0.109244 -0.282227 0.398604 0.089468 0.094197 0.087971 0.116786 0.108668 0.096357 0.216025 0.123023 0.119041 0.119324 0.138146 0.138800 0.094699 0.104511 0.114134 0.095710 0.172801 0.269687 0.105045 0.105792 0.097929 0.260834
qa: 0.7607 -0.4648 -0.6933 -0.5331 -0.5365 -0.2906 -0.4333 -0.2565 -0.3944 -0.1460 -0.1680 0.1862 -0.1933 0.2279 0.1010 -0.3215 0.3480 -0.2872 0.1092 -0.2822 0.3986 0.0895 0.0942 0.0880 0.1168 0.1087 0.0964 0.2160 0.1230 0.1190 0.1193 0.1381 0.1388 0.0947 0.1045 0.1141 0.0957 0.1728 0.2697 0.1050 0.1058 0.0979 0.2608
va: 5.0244 2.0614 1.8673 1.9840 1.9679 2.2089 2.0590 3.1515 3.0708 3.2991 3.8613 3.7373 3.8418 4.3140 3.9154 3.9115 4.0011 3.9418 3.8206 3.9172 4.2427 1.0261 1.0211 1.0373 1.0095 1.0149 1.0200 1.0465 1.0160 1.0078 1.0058 1.0356 1.0207 1.0167 1.0107 1.0028 1.0346 1.0314 1.0752 1.0035 1.0165 1.0136 0.9920
dispcorr: -0.025161650 hartree
energy: -1389.760670014122
dipole: 6.00114 -5.85386 0.14728 -5.91891 7.16900 1.25009 -2.76848 2.33245 -0.43604
magnitude: 1.33212 au
magnitude: 3.38597 debye
