program: Orca
programVersion: 5.0.2
elementType: P O O O O O O N N N C C C C C C C C C C C H H H H H H H H H H H H H H H H H H H H H H
charge: 0
multiplicity: 1
keywords: wb97x-d3
keywords: def2-TZVPP
keywords: def2/J RIJCOSX
keywords: DEFGRID2
keywords: scfconv7
keywords: smallprint printgap noloewdin
keywords: NOSOSCF
formula: C11H22N3O6P
InChI: InChI=1/C11H22N3O6P/c1-6(9(15)14-7(2)11(17)18)13-10(16)8(12)4-5-21(3,19)20/h6-8,13-14,17,19H,4-5,12H2,1-3H3
43 atoms
P  2.924062 -1.388383 0.468221
O  2.58312 0.067197 -0.111461
O  2.229429 -1.727667 1.764404
O  -1.826441 -1.706384 -0.737106
O  0.119964 0.988455 -0.407206
O  -2.175747 5.211067 -0.987837
O  -2.75877 4.188185 0.908207
N  -0.512844 -1.311107 1.044623
N  -0.62247 -4.267057 -1.042106
N  -1.945829 1.781171 0.005739
C  1.151787 -2.609167 -1.4015
C  0.074398 -3.153506 -0.431353
C  2.578919 -2.580876 -0.85617
C  -0.853219 -2.002927 -0.052403
C  -1.157078 -0.063006 1.35217
C  4.712027 -1.317809 0.627168
C  -0.938899 0.937084 0.219588
C  -0.58736 0.517443 2.640926
C  -1.904838 2.877414 -0.929074
C  -2.776228 2.606623 -2.155085
C  -2.328754 4.147764 -0.215601
H  1.156391 -3.266708 -2.27237
H  0.884491 -1.620112 -1.782251
H  0.560544 -3.530286 0.471755
H  3.266468 -2.35113 -1.67474
H  2.863368 -3.568644 -0.482259
H  -2.230616 -0.224511 1.483547
H  0.373848 -1.524007 1.502705
H  5.092485 -2.29566 0.922222
H  4.986645 -0.597102 1.398056
H  5.188001 -1.02906 -0.309353
H  -1.159872 -3.934562 -1.834695
H  -1.297257 -4.647724 -0.389349
H  -1.074689 1.460759 2.883928
H  -0.756696 -0.169935 3.46936
H  0.484775 0.697346 2.557526
H  -0.870285 3.006984 -1.253257
H  -2.799589 1.64767 0.529176
H  1.621564 0.312132 -0.167254
H  -2.691386 3.406911 -2.888244
H  -2.45193 1.682004 -2.630353
H  -3.826188 2.499649 -1.880409
H  -2.467127 6.011257 -0.522746
elementType: P O N C H
totalener: -1389.73565066 hartree
nucrepener: 2064.22262499 hartree
electener: -3453.95827566 hartree
oneelecener: -6010.93748461 hartree
twoeener: 2556.97920896 hartree
cpcmener: -0.05541746 hartree
kineticenergy: 1384.44374869 hartree
xcener: -114.433200197048 hartree
chargesum: 0.0000000
charge: 0.758023 -0.461222 -0.694265 -0.533864 -0.534561 -0.294029 -0.432737 -0.255818 -0.395034 -0.156438 -0.171058 0.187368 -0.191199 0.229842 0.088485 -0.318550 0.364203 -0.279033 0.100205 -0.275436 0.393563 0.087977 0.094871 0.088108 0.116279 0.108668 0.097018 0.216989 0.118881 0.122465 0.119394 0.138637 0.137839 0.099720 0.113364 0.096914 0.101255 0.174372 0.267420 0.103128 0.103650 0.104358 0.260248
qa: 0.7580 -0.4612 -0.6943 -0.5339 -0.5346 -0.2940 -0.4327 -0.2558 -0.3950 -0.1564 -0.1711 0.1874 -0.1912 0.2298 0.0885 -0.3185 0.3642 -0.2790 0.1002 -0.2754 0.3936 0.0880 0.0949 0.0881 0.1163 0.1087 0.0970 0.2170 0.1189 0.1225 0.1194 0.1386 0.1378 0.0997 0.1134 0.0969 0.1013 0.1744 0.2674 0.1031 0.1036 0.1044 0.2602
va: 5.0275 2.0627 1.8674 1.9839 1.9728 2.2007 2.0573 3.1478 3.0684 3.3089 3.8585 3.7372 3.8324 4.3119 3.9210 3.9086 3.9905 3.9331 3.7756 3.9496 4.2563 1.0272 1.0235 1.0388 1.0101 1.0153 1.0238 1.0424 1.0060 1.0164 1.0076 1.0354 1.0210 1.0156 1.0036 1.0152 1.0486 1.0194 1.0754 1.0142 1.0055 1.0003 0.9923
dispcorr: -0.024469323 hartree
energy: -1389.760119987546
dipole: 1.97748 -2.12770 -0.15022 -6.23548 7.54694 1.31146 -3.35909 2.77954 -0.57955
magnitude: 1.44165 au
magnitude: 3.66439 debye
