program: Orca
programVersion: 5.0.2
elementType: P O O O O O O N N N C C C C C C C C C C C H H H H H H H H H H H H H H H H H H H H H H
charge: 0
multiplicity: 1
keywords: wb97x-d3
keywords: def2-TZVPP
keywords: def2/J RIJCOSX
keywords: DEFGRID2
keywords: scfconv7
keywords: smallprint printgap noloewdin
keywords: NOSOSCF
formula: C11H22N3O6P
InChI: InChI=1/C11H22N3O6P/c1-6(9(15)14-7(2)11(17)18)13-10(16)8(12)4-5-21(3,19)20/h6-8,13-14,17,19H,4-5,12H2,1-3H3
43 atoms
P  2.248883 -0.194135 0.386664
O  2.117157 -0.176877 -1.219385
O  1.026214 0.279128 1.130389
O  -0.212943 -1.627309 -1.322742
O  -3.230042 1.483288 -1.135122
O  0.084281 2.220915 -1.903858
O  1.185014 3.526161 -0.47043
N  -1.655064 -1.405775 0.387388
N  -0.353716 -4.193346 0.573231
N  -1.400895 1.322821 0.187839
C  1.72892 -2.981254 0.330086
C  0.253676 -2.872127 0.707932
C  2.667604 -1.89052 0.850494
C  -0.528695 -1.88209 -0.158266
C  -2.673767 -0.691068 -0.351837
C  3.692424 0.837716 0.650677
C  -2.444216 0.816281 -0.473439
C  -4.03751 -0.958217 0.273261
C  -1.013962 2.712651 0.126769
C  -0.794723 3.291178 1.513397
C  0.215591 2.869204 -0.757129
H  2.083937 -3.924822 0.74634
H  1.827547 -3.074282 -0.753964
H  0.168366 -2.574863 1.757283
H  3.679628 -2.100617 0.495074
H  2.70934 -1.913472 1.942879
H  -2.681763 -1.070953 -1.376275
H  -1.851789 -1.634211 1.351881
H  4.551463 0.486552 0.080231
H  3.952171 0.838208 1.709184
H  3.465882 1.862774 0.35485
H  -0.338637 -4.485152 -0.398109
H  -1.326506 -4.171926 0.854212
H  -4.824666 -0.478114 -0.303615
H  -4.241191 -2.028719 0.287999
H  -4.089153 -0.583635 1.297006
H  -1.819049 3.266881 -0.364824
H  -0.720414 0.709525 0.632657
H  1.330929 -0.686617 -1.512336
H  -1.707935 3.188819 2.098489
H  0.009325 2.781505 2.043914
H  -0.552141 4.351464 1.463128
H  0.878013 2.340547 -2.448555
elementType: P O N C H
totalener: -1389.73258051 hartree
nucrepener: 2173.65270222 hartree
electener: -3563.38528272 hartree
oneelecener: -6229.80339806 hartree
twoeener: 2666.41811534 hartree
cpcmener: -0.05828651 hartree
kineticenergy: 1384.43974592 hartree
xcener: -114.432460660799 hartree
chargesum: 0.0000000
charge: 0.786677 -0.443930 -0.691401 -0.531486 -0.538298 -0.272593 -0.433491 -0.183839 -0.365825 -0.219579 -0.192395 0.226341 -0.193809 0.178370 0.118233 -0.321262 0.309956 -0.280296 0.114406 -0.274167 0.358141 0.089027 0.101235 0.095679 0.113922 0.105295 0.087137 0.182521 0.122874 0.122081 0.127626 0.143525 0.141329 0.096672 0.106964 0.102171 0.096507 0.208750 0.272242 0.100774 0.092201 0.096852 0.244867
qa: 0.7867 -0.4439 -0.6914 -0.5315 -0.5383 -0.2726 -0.4335 -0.1838 -0.3658 -0.2196 -0.1924 0.2263 -0.1938 0.1784 0.1182 -0.3213 0.3100 -0.2803 0.1144 -0.2742 0.3581 0.0890 0.1012 0.0957 0.1139 0.1053 0.0871 0.1825 0.1229 0.1221 0.1276 0.1435 0.1413 0.0967 0.1070 0.1022 0.0965 0.2087 0.2722 0.1008 0.0922 0.0969 0.2449
va: 4.9529 2.0746 1.8708 1.9526 1.9931 2.2076 2.0595 3.1991 3.0410 3.1310 3.9177 3.7657 3.9127 4.1861 3.7748 3.9176 4.2164 3.9375 3.7373 3.9645 4.2905 1.0279 1.0201 1.0203 1.0110 1.0166 1.0395 1.0059 1.0085 1.0058 1.0177 1.0234 1.0277 1.0220 1.0048 0.9997 1.0463 1.0529 1.0358 1.0071 1.0195 1.0108 1.0052
dispcorr: -0.027161493 hartree
energy: -1389.759742001703
dipole: -1.70556 2.80930 1.10374 -8.57144 5.94745 -2.62399 9.42485 -7.74265 1.68220
magnitude: 3.30656 au
magnitude: 8.40462 debye
