program: Gaussian 09
title: 000057769
version: EM64L-G09RevD.01
frameworkgroup: C1[X(C19H31NO3)]
method: RPBEPBE
basis: SDD
operation: Freq
keyword: #p
keyword: freq=noraman
keyword: PBEPBE/SDD
title: #p freq=noraman PBEPBE/SDD
converged: YES YES NO NO
title: Mulliken charges:
elementType: O O O N C C C C C C C C C C C C C C C C C C C H H H H H H H H H H H H H H H H H H H H H H H H H H H H H H H
charge: -0.290130 -0.444851 -0.256514 -0.086272 0.001439 0.429361 0.414534 -0.386111 -0.529671 -0.524260 -0.277203 -0.545027 -0.577746 -0.384460 -0.307565 -0.369309 -0.369308 0.272513 -0.683544 -0.697057 -0.692414 -0.692143 0.077797 0.203854 0.222388 0.206788 0.199174 0.203734 0.206103 0.213480 0.202461 0.283501 0.280491 0.216286 0.220887 0.201951 0.187862 0.235475 0.208345 0.231888 0.209348 0.224162 0.220088 0.217830 0.229552 0.215477 0.212988 0.209902 0.207375 0.222824 0.208776 0.210841 0.222038 0.382071
chargesum: 0.00000
title: Mulliken charges with hydrogens summed into heavy atoms:
elementType: O O O N C C C C C C C C C C C C C C C C C C C
charge: -0.290130 -0.062780 -0.256514 -0.086272 0.001439 0.429361 0.414534 0.040131 -0.123709 -0.114424 0.138738 -0.261526 -0.297256 0.052713 0.082248 0.074511 0.071928 0.272513 -0.021463 -0.039040 -0.052313 -0.050487 0.077797
polarizability: 3.01013987e+02 5.35761261e+00 2.38958126e+02 2.32929877e+01 -2.20781744e+00 1.71827324e+02
1716.lowfreq: -16.4973 -6.4777 -4.5139 -0.0006 -0.0003 0.0002 7.3568 18.1289 23.0185
frequency: -15.5059 17.6942 22.7785 29.6656 34.6280 47.0116 56.7403 60.7618 67.0352 74.6049 78.7491 80.6231 117.2742 123.5264 143.4463 159.3679 166.6337 200.2777 219.3790 223.3967 229.0804 231.0624 268.6497 273.2502 277.5001 281.9327 284.8596 288.2825 298.8739 313.2439 376.0921 397.7496 418.0760 426.5860 488.7283 499.9550 539.6419 545.2590 562.3831 582.5443 610.7105 628.8875 642.9779 702.8813 737.7883 743.5389 744.4519 760.3780 772.6287 791.9148 799.0397 810.2946 866.0673 867.6688 875.8281 877.7068 895.3408 912.9007 932.4260 938.0925 944.5127 973.6694 982.8509 1033.4303 1038.8177 1050.9191 1056.0607 1063.9243 1065.8466 1082.8134 1084.8927 1087.6388 1090.0602 1094.9455 1096.4250 1113.8210 1124.2457 1150.6465 1176.1889 1203.9590 1217.4783 1226.2676 1230.2867 1247.9667 1259.4719 1271.6785 1277.2502 1281.3583 1284.3035 1286.7052 1288.8430 1317.9276 1333.8607 1334.2486 1337.2547 1340.6836 1347.1659 1366.4391 1377.9765 1384.0041 1385.2113 1386.6567 1388.0733 1388.3733 1425.3149 1448.9564 1458.5216 1466.3765 1466.6020 1469.4102 1471.8759 1474.2111 1475.2728 1476.5097 1476.9363 1477.7089 1480.4715 1484.0122 1485.7177 1487.2805 1490.9304 1497.0286 1585.1778 1606.8918 1640.4327 2864.2527 2906.7039 2970.3502 2971.1329 2974.8498 2978.9251 2982.9596 2984.9512 2985.1645 2992.3146 2993.4489 2994.0851 3011.5070 3027.3518 3029.1477 3030.9558 3042.5346 3048.7481 3052.5997 3054.2606 3072.1608 3072.6292 3073.6532 3074.1925 3074.3567 3077.6213 3081.8568 3090.6961 3143.7519 3158.3082 3531.2639
redmass: 3.3141 3.7172 4.1397 3.5747 3.0500 2.8034 8.3975 3.3111 2.6523 1.7625 1.9064 2.7921 3.2789 3.0967 2.8832 1.7564 3.2105 2.8819 1.5517 1.6937 1.2622 1.1960 1.9452 3.3640 2.3928 2.9647 2.8978 2.2021 3.5869 3.6176 5.2719 2.4783 4.3352 4.8832 2.7241 2.8569 2.9456 2.9986 3.6228 4.6656 1.6331 5.3640 3.7564 3.3414 3.7644 1.4754 1.1111 2.4938 1.1371 1.3664 1.8251 1.5736 1.4663 1.3703 2.1578 1.6547 2.0142 4.1743 1.4036 5.8131 1.6499 2.4712 3.8062 2.5976 2.4331 2.9166 2.7038 1.6722 2.2107 1.7493 2.0755 2.5303 1.7064 2.2267 1.9112 1.6547 1.8325 1.3125 2.4475 2.0790 1.4383 1.3973 1.7828 1.3944 1.6184 1.1290 1.3137 1.4968 1.1940 1.1687 1.1425 1.3370 1.4371 1.5838 1.4452 1.2497 2.8801 1.3784 1.2778 4.4939 1.4704 1.2137 1.2149 1.2467 4.4801 2.2280 1.0701 1.1059 1.0533 1.1601 1.1318 1.0590 1.0559 1.0500 1.0502 1.0590 1.0514 1.0775 1.0811 1.0822 1.0876 1.0755 8.6540 6.1751 8.5651 1.0712 1.0694 1.0356 1.0355 1.0562 1.0351 1.0590 1.0596 1.0366 1.0611 1.0613 1.0611 1.0869 1.0988 1.0984 1.0980 1.1013 1.1019 1.1015 1.0999 1.0998 1.0995 1.1016 1.0996 1.1016 1.0990 1.1008 1.1005 1.0919 1.0921 1.0641
irintensity: 0.0569 0.0443 0.0237 0.0372 0.1637 0.1051 1.2028 0.4824 0.5039 0.0930 0.0992 0.3500 0.1300 0.3503 1.2832 1.1441 2.3182 0.3274 0.5699 0.7583 0.5561 0.7161 1.0578 2.3407 0.4956 1.4160 1.4083 5.1389 6.4042 1.0930 4.6767 0.4640 6.4518 6.1568 8.8464 11.1570 26.7763 27.1315 18.6425 41.2650 79.0222 3.5113 22.3371 5.2144 25.4382 14.0649 3.1778 4.5111 5.6218 6.9491 3.1777 11.4505 6.3116 1.3144 20.6435 0.0583 10.9619 94.3305 0.9555 66.8036 41.1305 10.4817 22.2273 187.0445 11.7161 6.1889 0.7116 6.2611 21.3344 123.2301 22.0628 15.4941 23.8052 16.7487 6.5109 26.7961 263.0186 3.6462 54.6556 31.9293 0.5693 12.4717 18.4669 5.0259 7.3961 0.5081 1.3098 5.8628 17.7469 0.8515 1.4607 35.1321 24.9493 33.3892 3.2099 0.7133 115.8876 9.7376 19.6715 4.2741 7.6759 10.0681 10.2054 23.5347 22.4924 45.3101 12.1778 2.0500 14.1196 3.2836 21.3507 4.3971 2.8920 0.4590 3.0075 7.3196 8.1456 4.9805 2.9501 25.8601 20.3251 1.3687 34.5724 44.4939 326.9786 83.2758 64.8229 43.6693 37.5601 29.4153 30.2772 10.2176 1.8101 26.8582 49.9051 30.4564 75.8731 23.0442 11.3234 7.4908 3.2407 11.2711 2.5768 7.1124 45.4244 46.0558 71.2630 65.4749 49.2490 65.8293 69.1080 48.9462 41.9005 1.9673 0.9289 46.6256
temp: 298.150 k
press: 1.00000 atm
elementType: 8 8 8 7 6 6 6 6 6 6 6 6 6 6 6 6 6 6 6 6 6 6 6 1 1 1 1 1 1 1 1 1 1 1 1 1 1 1 1 1 1 1 1 1 1 1 1 1 1 1 1 1 1 1
symmnumber: 1
zpe: 1221305.9 jmol-1
zpe.correction: 0.465171 hartree
zpe.thermalcorrener: 0.491641 hartree
zpe.thermalcorrenthalpy: 0.492585 hartree
zpe.thermalcorrgfe: 0.405431 hartree
zpe.sumelectzpe: -1021.226646 hartree
zpe.sumelectthermal: -1021.200176 hartree
zpe.sumelectthermalent: -1021.199232 hartree
zpe.sumelectthermalfe: -1021.286386 hartree
dipole: 3.7849 -1.2730 0.4838
dipole: 4.0225
quadrupole: -141.3540 -134.3679 -145.3159
quadrupole: 8.4595 -3.3304 2.4865
quadrupole: -1.0080 5.9780 -4.9700 8.4595 -3.3304 2.4865
hfenergy: -1021.6918172 hartree
pointgroup: C01 [X(C19H31N1O3)]
dipole: -1.5048205 0.4590431 0.1710875 debye
polarizability: 300.119975|5.8710742|239.2766619|-24.9561287|-3.5155065|172.4027998 unknown
InChI: InChI=1S/C19H31NO3/c1-5-9-15-13-17(19(21)22)14-16(10-6-2)18(15)23-12-11-20(7-3)8-4/h13-14,21H,5-12H2,1-4H3
charge 0 multiplicity 1
54 atoms
O  -0.548616 -0.318242 0.592842
O  5.187911 1.933751 -1.201322
O  5.635375 -0.331051 -1.435292
N  -4.043938 -0.341943 -0.765096
C  0.775959 -0.085605 0.134887
C  1.243573 1.257924 0.054521
C  1.608878 -1.202586 -0.15954
C  -2.949177 -0.370802 0.232016
C  0.359525 2.42152 0.471862
C  1.114156 -2.626448 0.031082
C  -1.585748 -0.350725 -0.475108
C  2.574886 1.472245 -0.363784
C  2.93324 -0.945856 -0.573542
C  -5.182282 -1.242596 -0.452429
C  -4.413588 1.035022 -1.181901
C  0.295838 2.590612 2.016525
C  1.204061 -3.085677 1.514574
C  3.420501 0.380645 -0.683164
C  -6.049972 -0.849449 0.7746
C  -5.227497 1.080402 -2.488233
C  -0.621318 3.75753 2.437866
C  0.713499 -4.535559 1.706775
C  4.819528 0.575928 -1.133569
H  -2.991031 0.478448 0.953596
H  -3.017543 -1.298055 0.829595
H  0.741521 3.357809 0.020839
H  -0.673973 2.281126 0.102047
H  0.061278 -2.722605 -0.293355
H  1.714078 -3.314206 -0.595777
H  -1.461459 -1.255522 -1.100768
H  -1.47909 0.540213 -1.126025
H  2.967231 2.490818 -0.44208
H  3.607939 -1.774392 -0.816503
H  -4.766585 -2.256187 -0.295319
H  -5.825526 -1.310274 -1.349099
H  -3.471509 1.594219 -1.338723
H  -4.96801 1.58122 -0.377558
H  -0.067304 1.644512 2.459616
H  1.319969 2.75583 2.40461
H  0.601045 -2.395613 2.134288
H  2.252913 -2.99341 1.858324
H  -5.440696 -0.793016 1.695556
H  -6.543111 0.129005 0.629778
H  -6.842083 -1.603717 0.938463
H  -4.695328 0.53649 -3.288505
H  -6.229325 0.629156 -2.37166
H  -5.372231 2.128134 -2.809899
H  -0.273203 4.716627 2.009183
H  -1.659335 3.591488 2.091464
H  -0.647243 3.869144 3.537237
H  -0.341547 -4.643314 1.390313
H  1.317356 -5.245005 1.109612
H  0.781162 -4.843717 2.766129
H  6.132746 1.984951 -1.507652
