program: Orca
programVersion: 5.0.2
elementType: P O O O O O O N N N C C C C C C C C C C C H H H H H H H H H H H H H H H H H H H H H H
charge: 0
multiplicity: 1
keywords: wb97x-d3
keywords: def2-TZVPP
keywords: def2/J RIJCOSX
keywords: DEFGRID2
keywords: scfconv7
keywords: smallprint printgap noloewdin
keywords: NOSOSCF
formula: C11H22N3O6P
InChI: InChI=1/C11H22N3O6P/c1-6(9(15)14-7(2)11(17)18)13-10(16)8(12)4-5-21(3,19)20/h6-8,13-14,17,19H,4-5,12H2,1-3H3
43 atoms
P  2.957018 -1.407032 0.558568
O  2.659769 0.097757 0.093118
O  2.236727 -1.831672 1.81543
O  -1.753066 -1.471691 -0.743192
O  0.216361 1.070072 -0.261691
O  -2.654584 4.97056 -1.294457
O  -3.409627 3.974948 0.556083
N  -0.449675 -1.2980 1.079766
N  -0.6569 -4.032432 -1.290762
N  -1.870532 1.797892 0.14879
C  1.199522 -2.436762 -1.44835
C  0.078384 -3.023733 -0.555283
C  2.61115 -2.480037 -0.864425
C  -0.804292 -1.874031 -0.077315
C  -1.031401 -0.042215 1.478679
C  4.74226 -1.394864 0.757029
C  -0.84286 0.981728 0.362964
C  -0.365442 0.464702 2.751263
C  -1.882412 2.79645 -0.891779
C  -2.390877 2.221674 -2.215223
C  -2.733403 3.964325 -0.440631
H  1.218015 -3.032129 -2.362602
H  0.963226 -1.418412 -1.767239
H  0.527927 -3.515023 0.311724
H  3.322781 -2.19887 -1.645625
H  2.867712 -3.501026 -0.567698
H  -2.100817 -0.171955 1.668482
H  0.418506 -1.591338 1.530874
H  5.247932 -1.039421 -0.140034
H  5.091814 -2.404004 0.97529
H  5.015338 -0.750926 1.593667
H  -1.155608 -3.594257 -2.057327
H  -1.368342 -4.440293 -0.695661
H  -0.81684 1.403596 3.068882
H  -0.49477 -0.257491 3.557342
H  0.702526 0.629865 2.607475
H  -0.863262 3.163822 -1.030752
H  -2.734688 1.623018 0.6417
H  1.705255 0.362956 0.005359
H  -2.317668 2.949705 -3.021265
H  -1.788456 1.357197 -2.491819
H  -3.429221 1.899325 -2.131352
H  -3.224649 5.702129 -1.010167
elementType: P O N C H
totalener: -1389.73550729 hartree
nucrepener: 2074.10097786 hartree
electener: -3463.83648515 hartree
oneelecener: -6030.66349358 hartree
twoeener: 2566.82700843 hartree
cpcmener: -0.05385499 hartree
kineticenergy: 1384.44508395 hartree
xcener: -114.434299338752 hartree
chargesum: 0.0000000
charge: 0.757928 -0.461934 -0.692682 -0.533027 -0.536831 -0.291176 -0.432412 -0.257210 -0.393876 -0.148121 -0.168651 0.192091 -0.191499 0.226231 0.099054 -0.320863 0.350700 -0.287710 0.106981 -0.283513 0.397847 0.088442 0.094732 0.087687 0.116055 0.108370 0.096171 0.216709 0.119098 0.119017 0.123095 0.137944 0.137862 0.103672 0.114281 0.095496 0.096414 0.172834 0.270019 0.105129 0.099540 0.106211 0.259898
qa: 0.7579 -0.4619 -0.6927 -0.5330 -0.5368 -0.2912 -0.4324 -0.2572 -0.3939 -0.1481 -0.1687 0.1921 -0.1915 0.2262 0.0991 -0.3209 0.3507 -0.2877 0.1070 -0.2835 0.3978 0.0884 0.0947 0.0877 0.1161 0.1084 0.0962 0.2167 0.1191 0.1190 0.1231 0.1379 0.1379 0.1037 0.1143 0.0955 0.0964 0.1728 0.2700 0.1051 0.0995 0.1062 0.2599
va: 5.0243 2.0643 1.8676 1.9825 1.9650 2.2032 2.0611 3.1528 3.0708 3.3076 3.8555 3.7382 3.8421 4.3116 3.9153 3.9121 4.0031 3.9385 3.7906 3.9390 4.2555 1.0273 1.0225 1.0364 1.0099 1.0151 1.0204 1.0453 1.0078 1.0059 1.0160 1.0359 1.0213 1.0119 1.0027 1.0162 1.0415 1.0259 1.0728 1.0156 1.0112 1.0015 0.9926
dispcorr: -0.024977620 hartree
energy: -1389.760484910857
dipole: 3.88879 -3.87772 0.01107 -6.76242 7.87158 1.10916 -3.41962 2.82382 -0.59580
magnitude: 1.25910 au
magnitude: 3.20038 debye
