program: Orca
programVersion: 5.0.2
elementType: P O O O O O O N N N C C C C C C C C C C C H H H H H H H H H H H H H H H H H H H H H H
charge: 0
multiplicity: 1
keywords: wb97x-d3
keywords: def2-TZVPP
keywords: def2/J RIJCOSX
keywords: DEFGRID2
keywords: scfconv7
keywords: smallprint printgap noloewdin
keywords: NOSOSCF
formula: C11H22N3O6P
InChI: InChI=1/C11H22N3O6P/c1-6(9(15)14-7(2)11(17)18)13-10(16)8(12)4-5-21(3,19)20/h6-8,13-14,17,19H,4-5,12H2,1-3H3
43 atoms
P  2.913486 -0.057074 -0.131825
O  3.003764 0.860078 -1.450167
O  2.540881 0.737378 1.105871
O  -0.869692 -1.042801 1.642932
O  -1.486055 0.22859 -1.575443
O  0.22179 1.811898 0.972459
O  0.700323 2.497565 -1.103976
N  -2.08045 -1.999895 0.002947
N  -0.187913 -3.764133 -0.608855
N  -2.376815 1.482162 0.048894
C  1.452244 -2.319937 0.659581
C  0.069159 -2.986355 0.588012
C  1.701325 -1.348675 -0.500319
C  -1.007628 -1.921362 0.800281
C  -3.018979 -0.903501 -0.13723
C  4.538957 -0.799125 -0.029573
C  -2.228041 0.324456 -0.605515
C  -3.929777 -0.712213 1.06495
C  -1.571744 2.632174 -0.313626
C  -1.925466 3.817616 0.57146
C  -0.086427 2.29644 -0.196109
H  1.544257 -1.811708 1.620066
H  2.214485 -3.101756 0.652221
H  -0.010323 -3.666503 1.442156
H  0.78899 -0.814535 -0.784357
H  2.032703 -1.875086 -1.39884
H  -3.651788 -1.16548 -0.988679
H  -2.066433 -2.731137 -0.693693
H  4.568456 -1.500422 0.804589
H  5.293846 -0.030886 0.138667
H  4.779386 -1.338647 -0.945417
H  0.308392 -4.644275 -0.564614
H  0.149192 -3.281624 -1.434151
H  -4.443122 -1.648407 1.28282
H  -3.395741 -0.408912 1.963779
H  -4.697969 0.031405 0.848162
H  -1.76175 2.894003 -1.356117
H  -2.884152 1.510729 0.920383
H  2.260764 1.499652 -1.483844
H  -2.969524 4.095916 0.428246
H  -1.769895 3.595736 1.627552
H  -1.313947 4.680928 0.31129
H  1.172167 1.453617 1.038486
elementType: P O N C H
totalener: -1389.73538053 hartree
nucrepener: 2164.20482496 hartree
electener: -3553.94020549 hartree
oneelecener: -6212.19542685 hartree
twoeener: 2658.25522135 hartree
cpcmener: -0.06066121 hartree
kineticenergy: 1384.42520872 hartree
xcener: -114.439365214067 hartree
chargesum: 0.0000000
charge: 0.764288 -0.445776 -0.648920 -0.527287 -0.520510 -0.355855 -0.490372 -0.185928 -0.394524 -0.182623 -0.198118 0.216102 -0.211507 0.211120 0.131587 -0.301491 0.289713 -0.309093 0.127596 -0.294975 0.400586 0.085258 0.105278 0.103323 0.105704 0.123621 0.102916 0.175012 0.127527 0.128785 0.125505 0.138757 0.158813 0.098909 0.098792 0.110821 0.089473 0.185694 0.272783 0.111433 0.102863 0.107759 0.266960
qa: 0.7643 -0.4458 -0.6489 -0.5273 -0.5205 -0.3559 -0.4904 -0.1859 -0.3945 -0.1826 -0.1981 0.2161 -0.2115 0.2111 0.1316 -0.3015 0.2897 -0.3091 0.1276 -0.2950 0.4006 0.0853 0.1053 0.1033 0.1057 0.1236 0.1029 0.1750 0.1275 0.1288 0.1255 0.1388 0.1588 0.0989 0.0988 0.1108 0.0895 0.1857 0.2728 0.1114 0.1029 0.1078 0.2670
va: 4.9759 2.0958 1.9106 1.9805 1.9964 2.1406 2.0121 3.1478 3.0652 3.2237 3.9021 3.8855 3.7685 4.2399 3.8640 3.9024 4.1564 3.9118 3.8312 3.9480 4.1268 1.0515 1.0080 1.0138 1.0378 1.0228 1.0092 1.0509 1.0063 1.0147 1.0061 1.0208 1.0196 1.0094 1.0175 1.0037 1.0337 1.0036 1.0395 1.0026 1.0080 1.0049 1.0831
dispcorr: -0.026844765 hartree
energy: -1389.762225297838
dipole: -7.09824 6.10605 -0.99219 -6.92841 4.48295 -2.44546 2.84141 -3.14963 -0.30822
magnitude: 2.65701 au
magnitude: 6.75358 debye
