program: Orca
programVersion: 5.0.2
elementType: P O O O O O O N N N C C C C C C C C C C C H H H H H H H H H H H H H H H H H H H H H H
charge: 0
multiplicity: 1
keywords: wb97x-d3
keywords: def2-TZVPP
keywords: def2/J RIJCOSX
keywords: DEFGRID2
keywords: scfconv7
keywords: smallprint printgap noloewdin
keywords: NOSOSCF
formula: C11H22N3O6P
InChI: InChI=1/C11H22N3O6P/c1-6(9(15)14-7(2)11(17)18)13-10(16)8(12)4-5-21(3,19)20/h6-8,13-14,17,19H,4-5,12H2,1-3H3
43 atoms
P  2.857858 -1.26453 0.49824
O  2.454819 0.157478 -0.121135
O  2.207315 -1.577773 1.823593
O  -1.907878 -1.82025 -0.57345
O  -0.027467 0.973913 -0.491455
O  -1.211331 3.966263 0.524428
O  -1.970038 5.021633 -1.287846
N  -0.549898 -1.257315 1.127218
N  -0.605536 -4.340825 -0.7804
N  -2.156295 1.618107 -0.174141
C  1.086085 -2.630362 -1.273363
C  0.059037 -3.16984 -0.246468
C  2.524811 -2.518678 -0.771735
C  -0.903059 -2.037045 0.095612
C  -1.220257 -0.005707 1.360878
C  4.645617 -1.131396 0.610022
C  -1.08398 0.892763 0.136216
C  -0.603996 0.701303 2.561716
C  -2.172974 2.633402 -1.197414
C  -3.527239 2.674646 -1.890332
C  -1.788097 4.006527 -0.664279
H  1.093539 -3.327352 -2.113171
H  0.767241 -1.672092 -1.691683
H  0.584319 -3.478597 0.66038
H  3.177604 -2.29177 -1.619334
H  2.862972 -3.478296 -0.369965
H  -2.280333 -0.183292 1.561789
H  0.351254 -1.417728 1.579432
H  5.063663 -2.082452 0.939979
H  4.915711 -0.368156 1.340327
H  5.090761 -0.871884 -0.349769
H  -1.178482 -4.073228 -1.573201
H  -1.245929 -4.714968 -0.08978
H  -1.102816 1.652089 2.74579
H  -0.713309 0.08808 3.45601
H  0.457638 0.89716 2.407801
H  -1.411617 2.378332 -1.939973
H  -2.990883 1.505545 0.384404
H  1.48431 0.363208 -0.195873
H  -3.749516 1.69929 -2.320708
H  -4.328166 2.935779 -1.19709
H  -3.526606 3.40251 -2.698562
H  -0.954562 4.860812 0.799422
elementType: P O N C H
totalener: -1389.73455654 hartree
nucrepener: 2083.22573345 hartree
electener: -3472.96028999 hartree
oneelecener: -6048.71746805 hartree
twoeener: 2575.75717806 hartree
cpcmener: -0.05867411 hartree
kineticenergy: 1384.45089303 hartree
xcener: -114.434948602853 hartree
chargesum: -0.0000000
charge: 0.758115 -0.461749 -0.693969 -0.532203 -0.531080 -0.269992 -0.438979 -0.259970 -0.395425 -0.155689 -0.172927 0.186132 -0.190586 0.230308 0.102774 -0.319842 0.340639 -0.279398 0.098924 -0.265971 0.387813 0.088686 0.096032 0.089232 0.116272 0.109117 0.097299 0.216453 0.118895 0.122562 0.119260 0.138758 0.138078 0.097254 0.115715 0.096801 0.104028 0.180096 0.268144 0.106937 0.103390 0.094065 0.245998
qa: 0.7581 -0.4617 -0.6940 -0.5322 -0.5311 -0.2700 -0.4390 -0.2600 -0.3954 -0.1557 -0.1729 0.1861 -0.1906 0.2303 0.1028 -0.3198 0.3406 -0.2794 0.0989 -0.2660 0.3878 0.0887 0.0960 0.0892 0.1163 0.1091 0.0973 0.2165 0.1189 0.1226 0.1193 0.1388 0.1381 0.0973 0.1157 0.0968 0.1040 0.1801 0.2681 0.1069 0.1034 0.0941 0.2460
va: 5.0272 2.0633 1.8668 1.9878 1.9755 2.2089 2.0643 3.1521 3.0688 3.2796 3.8593 3.7351 3.8355 4.3179 3.8854 3.9106 4.0179 3.9427 3.7432 3.9614 4.2462 1.0266 1.0228 1.0394 1.0101 1.0150 1.0255 1.0441 1.0059 1.0162 1.0078 1.0352 1.0208 1.0156 1.0032 1.0168 1.0316 1.0065 1.0756 1.0065 0.9993 1.0176 1.0034
dispcorr: -0.024877453 hartree
energy: -1389.759433995005
dipole: -0.44414 0.19032 -0.25382 -6.30179 6.75978 0.45798 -0.72383 1.50843 0.78460
magnitude: 0.94328 au
magnitude: 2.39762 debye
