program: Orca
programVersion: 5.0.2
elementType: P O O O O O O N N N C C C C C C C C C C C H H H H H H H H H H H H H H H H H H H H H H
charge: 0
multiplicity: 1
keywords: wb97x-d3
keywords: def2-TZVPP
keywords: def2/J RIJCOSX
keywords: DEFGRID2
keywords: scfconv7
keywords: smallprint printgap noloewdin
keywords: NOSOSCF
formula: C11H22N3O6P
InChI: InChI=1/C11H22N3O6P/c1-6(9(15)14-7(2)11(17)18)13-10(16)8(12)4-5-21(3,19)20/h6-8,13-14,17,19H,4-5,12H2,1-3H3
43 atoms
P  2.741684 -1.092754 0.626495
O  2.284193 0.3382 0.06996
O  2.031164 -1.53346 1.883179
O  -1.89701 -1.887085 -0.816436
O  -0.228809 0.964459 -0.419674
O  -0.818164 4.296924 -1.677722
O  -1.090583 3.885892 0.501607
N  -0.683792 -1.400882 1.011333
N  -0.412287 -4.281887 -1.182161
N  -2.372026 1.51113 -0.133738
C  1.199273 -2.443328 -1.372302
C  0.136359 -3.137417 -0.48405
C  2.582836 -2.270979 -0.747042
C  -0.919405 -2.100933 -0.107447
C  -1.443128 -0.21377 1.305824
C  4.50601 -0.860168 0.874203
C  -1.298658 0.786826 0.166749
C  -0.938819 0.427079 2.593661
C  -2.309713 2.569026 -1.110807
C  -3.68737 3.192836 -1.297652
C  -1.32941 3.636284 -0.651045
H  1.329097 -3.069248 -2.256933
H  0.840171 -1.480724 -1.74544
H  0.614656 -3.507531 0.426561
H  3.278242 -1.936219 -1.521969
H  2.9606 -3.233817 -0.390826
H  -2.499913 -0.466543 1.428546
H  0.199304 -1.541141 1.504293
H  4.676232 -0.141339 1.676389
H  4.998358 -0.50174 -0.029172
H  4.961605 -1.807378 1.163907
H  -0.922292 -3.965337 -1.999472
H  -1.093033 -4.749127 -0.594843
H  0.111781 0.70855 2.516667
H  -1.514133 1.32187 2.827539
H  -1.047101 -0.268944 3.425431
H  -1.969777 2.166505 -2.068002
H  -3.237382 1.348957 0.360272
H  1.308788 0.477722 -0.068931
H  -4.05909 3.623413 -0.36729
H  -3.65193 3.979234 -2.049613
H  -4.395372 2.438594 -1.640413
H  -0.243349 5.013786 -1.36574
elementType: P O N C H
totalener: -1389.73644406 hartree
nucrepener: 2100.37637673 hartree
electener: -3490.11282079 hartree
oneelecener: -6083.79603968 hartree
twoeener: 2593.68321889 hartree
cpcmener: -0.05863750 hartree
kineticenergy: 1384.44873899 hartree
xcener: -114.434628863624 hartree
chargesum: -0.0000000
charge: 0.757718 -0.462768 -0.693222 -0.530884 -0.532224 -0.293801 -0.433517 -0.260751 -0.393606 -0.141954 -0.170998 0.186772 -0.192592 0.229340 0.105330 -0.319919 0.336783 -0.279009 0.098768 -0.282011 0.377121 0.088885 0.094664 0.089366 0.116213 0.108809 0.099284 0.216109 0.122853 0.118973 0.118795 0.138291 0.138180 0.096945 0.099631 0.115285 0.099894 0.177104 0.269542 0.108615 0.103569 0.113950 0.260466
qa: 0.7577 -0.4628 -0.6932 -0.5309 -0.5322 -0.2938 -0.4335 -0.2608 -0.3936 -0.1420 -0.1710 0.1868 -0.1926 0.2293 0.1053 -0.3199 0.3368 -0.2790 0.0988 -0.2820 0.3771 0.0889 0.0947 0.0894 0.1162 0.1088 0.0993 0.2161 0.1229 0.1190 0.1188 0.1383 0.1382 0.0969 0.0996 0.1153 0.0999 0.1771 0.2695 0.1086 0.1036 0.1139 0.2605
va: 5.0280 2.0630 1.8677 1.9895 1.9756 2.2065 2.0591 3.1507 3.0706 3.3164 3.8571 3.7376 3.8394 4.3183 3.8920 3.9116 4.0112 3.9396 3.8235 3.9420 4.1778 1.0266 1.0231 1.0365 1.0096 1.0147 1.0241 1.0457 1.0159 1.0078 1.0059 1.0350 1.0212 1.0178 1.0162 1.0029 1.0293 1.0078 1.0742 1.0015 1.0109 1.0012 0.9925
dispcorr: -0.025057564 hartree
energy: -1389.761501625908
dipole: -1.82366 1.15988 -0.66377 -3.84187 4.94720 1.10533 -1.10863 0.43671 -0.67192
magnitude: 1.45390 au
magnitude: 3.69552 debye
