program: Gaussian 09
title: 000057699
version: EM64L-G09RevD.01
frameworkgroup: C1[X(C13H18ClNO2)]
method: RPBEPBE
basis: SDD
operation: Freq
keyword: #p
keyword: freq=noraman
keyword: PBEPBE/SDD
title: #p freq=noraman PBEPBE/SDD
converged: YES YES NO NO
title: Mulliken charges:
elementType: Cl O O N C C C C C C C C C C C C C H H H H H H H H H H H H H H H H H H
charge: -0.087789 -0.299276 -0.260046 -0.096147 -0.017312 -0.413995 -0.387660 -0.348876 -0.313436 0.239791 0.244708 -0.636920 -0.574156 -0.372227 -0.377283 -0.226703 -0.225085 0.234653 0.229602 0.197982 0.189137 0.248904 0.227947 0.221093 0.230917 0.225641 0.236734 0.202252 0.222967 0.262064 0.270741 0.245248 0.249361 0.228227 0.228941
chargesum: 0.00000
title: Mulliken charges with hydrogens summed into heavy atoms:
elementType: Cl O O N C C C C C C C C C C C C C
charge: -0.087789 -0.299276 -0.260046 -0.096147 0.217342 0.013589 0.050381 0.100165 0.143122 0.239791 0.244708 0.025032 -0.041352 -0.126979 -0.127922 0.001524 0.003856
polarizability: 2.30424618e+02 -1.87403640e+01 1.61765400e+02 2.59785952e+00 4.12137980e+00 9.84699084e+01
1716.lowfreq: -4.5566 -0.0031 -0.0031 -0.0018 4.2645 13.7590 17.8045 21.5708 46.6353
frequency: 17.6968 21.2036 46.4895 55.8860 79.4140 105.6807 122.9382 157.5966 160.8184 178.6033 217.1371 226.0741 249.8835 289.6507 290.4703 354.0292 381.1218 416.1342 442.9149 450.1390 467.8989 482.8707 511.1695 545.0563 566.0553 645.9082 651.8221 712.1022 714.9795 753.8158 768.8005 773.2342 819.0442 831.1877 847.3042 867.5037 931.8091 958.0784 965.5945 968.6460 993.9523 1016.0693 1027.4892 1052.3122 1059.6449 1072.8114 1081.5902 1088.5268 1098.6169 1111.2948 1127.4782 1160.8294 1162.1851 1177.4646 1211.7399 1228.8764 1238.4994 1246.1669 1254.9086 1269.4294 1273.2491 1298.1559 1313.4380 1328.9887 1336.2027 1359.1407 1361.9393 1377.9108 1391.4424 1436.2126 1442.7097 1448.7862 1451.9800 1460.5913 1472.4808 1475.1705 1476.9546 1480.3348 1488.3769 1591.7806 1612.6316 2858.9217 2880.1812 2945.0105 2969.7380 2988.6633 2996.3984 3026.2496 3046.4109 3049.1734 3064.8902 3068.6420 3081.9861 3097.8528 3137.0729 3150.2783 3152.3695 3162.6653 3175.0045
redmass: 6.2167 7.3031 3.5647 4.7001 3.0809 3.5527 2.5634 2.6232 3.3097 2.1478 1.5804 3.4951 2.8044 4.9378 4.8411 3.1756 3.6562 2.9721 3.7853 3.1434 3.1864 3.7496 4.4032 4.4771 4.7374 4.8785 4.8933 4.3287 4.3062 1.2427 1.1989 1.6062 3.8466 2.9547 1.4023 4.0809 1.3683 3.7255 1.2933 2.1148 1.5408 2.4187 1.9832 3.1134 2.3003 3.4526 2.5086 2.5665 1.3742 1.7099 1.7446 1.1502 1.8963 1.5833 1.2390 2.0859 1.2811 1.9173 1.5164 1.4082 1.3501 1.2538 1.3776 1.3419 1.2955 1.3324 1.5489 1.4655 5.3686 1.1488 2.1474 1.1315 1.0960 1.1856 1.0636 2.4559 1.0879 1.0787 1.0796 7.5378 7.0925 1.0703 1.0558 1.0673 1.0830 1.0609 1.0661 1.0756 1.0938 1.0922 1.0582 1.0951 1.1005 1.1008 1.0851 1.0898 1.1122 1.0947 1.1007
irintensity: 0.5375 0.8102 0.2255 0.9032 1.2454 4.3629 4.3994 2.4327 2.1729 1.6327 0.9245 3.9289 2.9105 1.2536 0.6984 16.0177 1.7175 0.7511 4.3708 5.8079 1.2064 0.9831 5.6080 0.2406 3.3799 27.9437 89.6566 0.0393 14.9779 108.1219 11.5759 5.0948 17.2113 18.2960 0.0265 48.0679 5.2545 35.4221 0.0036 3.3259 1.5779 3.5595 8.6960 2.7313 126.9393 1.3301 24.3152 25.0478 8.1610 2.5986 15.3166 5.0452 8.5734 15.7430 5.8159 207.1108 9.0809 69.9367 17.4157 6.3599 13.4187 35.6755 4.2033 7.0942 17.0306 1.3252 12.8048 5.7741 22.5878 4.2607 4.9470 5.9686 5.1894 13.1127 22.4511 182.2031 4.6034 4.1301 10.1127 24.5580 5.0422 75.7063 141.9406 50.7080 22.0917 11.0648 65.9174 36.6011 16.8140 9.7904 13.5603 31.8696 37.7628 27.0450 1.0473 12.9898 19.3262 15.5856 15.0918
temp: 298.150 k
press: 1.00000 atm
elementType: 17 8 8 7 6 6 6 6 6 6 6 6 6 6 6 6 6 1 1 1 1 1 1 1 1 1 1 1 1 1 1 1 1 1 1
symmnumber: 1
zpe: 756378.6 jmol-1
zpe.correction: 0.288089 hartree
zpe.thermalcorrener: 0.305230 hartree
zpe.thermalcorrenthalpy: 0.306174 hartree
zpe.thermalcorrgfe: 0.240356 hartree
zpe.sumelectzpe: -1170.103473 hartree
zpe.sumelectthermal: -1170.086333 hartree
zpe.sumelectthermalent: -1170.085389 hartree
zpe.sumelectthermalfe: -1170.151207 hartree
dipole: -0.5354 1.6623 0.0692
dipole: 1.7478
quadrupole: -125.8855 -105.5041 -110.8715
quadrupole: 6.6544 1.5085 -1.3031
quadrupole: -11.7985 8.5829 3.2156 6.6544 1.5085 -1.3031
hfenergy: -1170.3915625 hartree
pointgroup: C01 [X(C13H18Cl1N1O2)]
dipole: 0.1776276 0.6634778 0.0328425 debye
polarizability: 228.4703936|21.8101032|164.0160901|2.5739735|1.8852974|98.1734434 unknown
InChI: InChI=1S/C13H18ClNO2/c1-15(9-7-14)8-6-11-10-16-12-4-2-3-5-13(12)17-11/h2-5,11H,6-10H2,1H3
charge 0 multiplicity 1
35 atoms
Cl -6.487654 -1.693993 0.137348
O  0.899548 0.590366 -0.178166
O  2.172605 -2.03976 -0.131986
N  -3.349513 1.023151 0.096812
C  0.137317 -0.651926 0.136024
C  -1.314345 -0.397307 -0.278977
C  -1.935687 0.801487 0.471443
C  0.787526 -1.829625 -0.603777
C  -4.311281 0.033047 0.629398
C  2.303487 0.437919 -0.083124
C  2.921647 -0.842465 -0.048502
C  -3.802056 2.421605 0.234687
C  -5.189889 -0.471845 -0.523992
C  3.094593 1.603233 -0.02205
C  4.321617 -0.946823 0.076559
C  4.497799 1.497097 0.090434
C  5.110607 0.221336 0.150179
H  0.213706 -0.825487 1.230767
H  -1.365898 -0.201585 -1.366063
H  -1.897476 -1.318438 -0.077938
H  -1.811629 0.652398 1.574255
H  -1.361396 1.706128 0.206817
H  0.264225 -2.776346 -0.394251
H  0.794158 -1.635533 -1.694793
H  -4.953471 0.462134 1.429291
H  -3.775115 -0.822892 1.077913
H  -3.149943 3.086232 -0.358705
H  -3.802767 2.784659 1.291651
H  -4.829489 2.525771 -0.157444
H  -5.763451 0.336378 -1.00132
H  -4.606257 -1.025053 -1.273254
H  2.594707 2.576588 -0.055778
H  4.769674 -1.945048 0.105255
H  5.107467 2.405262 0.138198
H  6.197833 0.135136 0.246191
