program: Orca
programVersion: 5.0.2
elementType: H C C C C C C H C O F F F H C C C C H C H H O N F C C H C H C C C H H C H N H
charge: 0
multiplicity: 1
keywords: wb97x-d3
keywords: def2-TZVPP
keywords: def2/J RIJCOSX
keywords: DEFGRID2
keywords: scfconv7
keywords: smallprint printgap noloewdin
keywords: NOSOSCF
formula: C19H12F4N2O2
InChI: InChI=1/C19H12F4N2O2/c20-13-7-9-14(10-8-13)24-18(26)16-5-2-6-17(25-16)27-15-4-1-3-12(11-15)19(21,22)23/h1-11,24H
39 atoms
H  3.128841 1.901978 1.471248
C  2.425406 1.958891 0.650746
C  1.701256 3.115552 0.391718
C  1.937553 4.342717 1.216448
C  0.801755 3.162555 -0.665141
C  0.645616 2.045871 -1.471769
C  1.374709 0.890316 -1.240499
H  1.259205 0.042762 -1.900405
C  2.254209 0.854298 -0.167391
O  3.063396 -0.224863 0.10095
F  2.387637 4.062273 2.443422
F  0.826165 5.071958 1.364663
F  2.849585 5.145904 0.648692
H  -0.046555 2.077414 -2.301892
C  0.856067 -2.963722 0.089931
C  2.586785 -1.490209 0.133212
C  3.532452 -2.510359 0.256598
C  3.062703 -3.803939 0.302738
H  3.758205 -4.626352 0.398876
C  1.693843 -4.051959 0.212807
H  1.309641 -5.060978 0.228604
H  0.227864 4.054536 -0.87604
O  -1.121894 -4.270588 -0.018683
N  -1.289968 -2.002973 -0.249799
F  -6.611565 -0.815518 -1.013475
C  -5.318058 -1.128002 -0.827278
C  -4.389837 -0.112076 -0.710387
H  -4.692552 0.925003 -0.768453
C  -3.061534 -0.444754 -0.51655
H  -2.326873 0.347058 -0.426195
C  -2.656286 -1.778989 -0.438493
C  -3.613934 -2.785182 -0.563255
C  -4.947853 -2.453871 -0.758809
H  -5.688987 -3.236183 -0.856882
H  4.588536 -2.28613 0.312518
C  -0.62305 -3.154698 -0.060285
H  -0.70533 -1.174011 -0.240915
N  1.301527 -1.707246 0.069082
H  -3.344887 -3.827198 -0.516431
elementType: H C O F N
totalener: -1390.76947888 hartree
nucrepener: 2327.52313544 hartree
electener: -3718.29261431 hartree
oneelecener: -6530.66879576 hartree
twoeener: 2812.37618145 hartree
cpcmener: -0.03228517 hartree
kineticenergy: 1385.45519972 hartree
xcener: -125.943855053784 hartree
chargesum: 0.0000000
charge: 0.140888 -0.228425 -0.006136 0.557231 -0.173819 -0.146199 -0.193988 0.148924 0.302629 -0.307056 -0.182348 -0.182767 -0.183216 0.165331 0.221494 0.401219 -0.221955 -0.082661 0.167118 -0.172700 0.145823 0.153333 -0.537400 -0.126147 -0.227596 0.251258 -0.147430 0.153432 -0.245322 0.149637 0.214241 -0.234127 -0.168946 0.152681 0.155940 0.353436 0.191293 -0.413151 0.155478
qa: 0.1409 -0.2284 -0.0061 0.5572 -0.1738 -0.1462 -0.1940 0.1489 0.3026 -0.3071 -0.1823 -0.1828 -0.1832 0.1653 0.2215 0.4012 -0.2220 -0.0827 0.1671 -0.1727 0.1458 0.1533 -0.5374 -0.1261 -0.2276 0.2513 -0.1474 0.1534 -0.2453 0.1496 0.2142 -0.2341 -0.1689 0.1527 0.1559 0.3534 0.1913 -0.4132 0.1555
va: 1.0247 4.1128 3.6634 4.4163 3.9917 3.8715 3.9056 1.0098 3.7151 2.1252 1.1190 1.1170 1.1039 0.9889 3.7188 3.8992 3.9713 3.9415 0.9882 3.9776 1.0222 1.0072 1.9747 3.2634 1.0469 3.9385 3.8697 0.9957 3.9318 1.0032 3.7653 3.9308 3.8960 0.9976 1.0011 4.1730 1.0228 3.0121 1.0380
dispcorr: -0.017572128 hartree
energy: -1390.787051003343
dipole: -1.78674 3.51066 1.72392 -22.69552 22.74049 0.04496 -8.50201 7.65407 -0.84793
magnitude: 1.92170 au
magnitude: 4.88457 debye
